{"text_format":"1","workbook":"xlsx","n_sheets":18,"sheets":["Foglio1","database2","DATOS","accessori vari","offerta","Offer","NOTE","calcoli vari","centraline","Prezzo P","database1","accessori centralina","EN 81.50","EN 81.50 (T)","EN 81.50 HCR-75","velocidad","lingue","COMPRESIBILIDAD DEL ACEITE"],"not_rendered":{"charts":7,"images":11,"macros":1,"external_links":1,"defined_names":10,"comments":1,"pivot_tables":0},"unopened":[],"bounds":{"document_bytes":16777216,"sheet_cells":100000,"rows_first":2000,"rows_last":500,"rows_between":2000,"halvings":0,"cell_chars":16384,"cell_head_chars":4096},"cells_cut":0,"cells_raw":0,"read":"whole","date_system":"1900"}

{"sheet":"Foglio1","index":0,"n_rows":0,"n_cols":0,"rows_kept":0,"cut":false,"hidden":true,"merged":[]}

{"sheet":"database2","index":1,"n_rows":28,"n_cols":15,"rows_kept":28,"cut":false,"hidden":true,"merged":[]}
[]
[]
[]
["CENTRALINE",null,null,null,null,null,null,null,null,null,null,"PESO","QUANTITA' OLIO"]
["TIPO",null,"POMPA","A","TUBO","B","C","D","E","F","G","SENZA OLIO","min","utile","totale"]
["CB",null,55,"1\"1/4",35,830,950,580,235,630,450,140,50,100,{"$f":"SUM(M6:N6)","v":150}]
["CB",null,75,"1\"1/4",35,830,950,580,235,630,450,140,50,100,150]
["CB",null,100,"1\"1/4",35,830,950,580,235,630,450,140,50,100,150]
["CB",null,125,"1\"1/4",35,830,950,580,235,630,450,140,50,100,150]
["CB",null,150,"1\"1/4",35,830,950,580,235,630,450,140,50,100,150]
["CM",null,55,"1\"1/4",35,980,950,580,235,780,450,150,50,150,200]
["CM",null,75,"1\"1/4",35,980,950,580,235,780,450,150,50,150,200]
["CM",null,100,"1\"1/4",35,980,950,580,235,780,450,150,50,150,200]
["CM",null,125,"1\"1/4",35,980,950,580,235,780,450,150,50,150,200]
["CM",null,150,"1\"1/4",35,980,950,580,235,780,450,150,50,150,200]
["CA",null,180,"1\"1/2",42,1080,1150,710,285,870,560,280,100,250,350]
["CA",null,210,"1\"1/2",42,1080,1150,710,285,870,560,280,100,250,350]
["CA",null,250,"1\"1/2",42,1080,1150,710,285,870,560,280,100,250,350]
["CA",null,300,"1\"1/2",42,1080,1150,710,285,870,560,280,100,250,350]
["CA/A",null,210,"1\"1/2",42,1080,1490,710,285,870,560,315,130,310,440]
["CA/A",null,250,"1\"1/2",42,1080,1490,710,285,870,560,315,130,310,440]
["CA/A",null,300,"1\"1/2",42,1080,1490,710,285,870,560,315,130,310,{"$f":"SUM(M22:N22)","v":440}]
["CA/A",null,380,"1\"1/2",42,1080,1490,710,285,870,560,315,130,310,{"$f":"SUM(M23:N23)","v":440}]
["CG",null,440,"2\"",50.8,1220,1490,910,305,1000,760,375,220,480,{"$f":"SUM(M24:N24)","v":700}]
["CG",null,500,"2\"",50.8,1220,1490,910,305,1000,760,375,220,480,{"$f":"SUM(M25:N25)","v":700}]
["CG",null,650,"2\"",50.8,1220,1490,910,305,1000,760,375,220,480,{"$f":"SUM(M26:N26)","v":700}]
[]
[null,null,"    "]

{"sheet":"DATOS","index":2,"n_rows":81,"n_cols":37,"rows_kept":81,"cut":false,"hidden":false,"merged":[]}
[null,"CALCULO EQUIPOS HIDRAULICOS",null,2023,null,null,null,null,null,null,"indice","diam.","spess.","pompa","CIF","valv.","riemp.","bobine","emerg.","NTA","an.protez.","da quotare","da quotare","tipo pistone","tipo piston","tipo pistone","attacco pistone","attacco pistone","centralina","emend. A3","eKMI","motore","pressostato","imballo centr.","Tipo manguera hidraulica","litros/m","Herzios"]
[null,null,null,"V.14",null,null,null,null,null,"diam",4,36,0,8,"NO","STD","S","12 VDC","12 VDC","230 VAC",0,1,{"$f":"INDEX(lingue!B257:E257,1,DATOS!$B$5)","v":"Pistón y central"},9130,"2",{"$f":"INDEX(lingue!B260:E260,1,DATOS!$B$5)","v":"Suspension 2:1 9130"},1,{"$f":"INDEX(lingue!B265:E265,1,DATOS!$B$5)","v":"Abajo"},"Lift","NO","12 VDC","230 VAC,  mono","N.C.",{"$f":"INDEX(lingue!B284:E284,1,DATOS!$B$5)","v":"standard: with thermoplastic foil"},"3/4''",0.31,50]
[null,null,null,{"$f":"TODAY()","v":"2023-11-30"},null,null,null,null,null,"spess",2,50,5,12,"CIF","ELE","D","24 VDC","NO","400 VAC",1,2,{"$f":"INDEX(lingue!B259:E259,1,DATOS!$B$5)","v":"Pistón"},9140,"1",{"$f":"INDEX(lingue!B261:E261,1,DATOS!$B$5)","v":"Tiro directo 9140"},2,{"$f":"INDEX(lingue!B264:E264,1,DATOS!$B$5)","v":"Arriba"},"HL","KMI","24 VDC","240 VAC,mono",{"$f":"INDEX(lingue!B277:D277,1,'accessori centralina'!$A$1)","v":{"$error":"#REF!"}},{"$f":"INDEX(lingue!B285:E285,1,DATOS!$B$5)","v":"with cardboard box and fumigated pallet"},35,0.65,60]
[null,null,null,null,null,null,null,null,null,"pompa",8,60,6,18,null,null,null,"48 VDC",null,null,null,3,{"$f":"INDEX(lingue!B55:E55,1,DATOS!$B$5)","v":"Central"},9150,1,{"$f":"INDEX(lingue!B262:E262,1,DATOS!$B$5)","v":"Tiro directo enterrado 9150"},null,null,null,"Door lock valve",null,"230x3 VAC",null,{"$f":"INDEX(lingue!B286:E286,1,DATOS!$B$5)","v":"with full plywood crate"},42,1]
[null,4,null,null,null,null,null,null,null,"centr.elettr.",1,70,7.5,23,null,null,null,"60 VDC",null,null,null,null,null,"MCE",2,"Suspensión 2:1 MCE",null,null,null,null,null,"400x3 VAC",null,null,"2''",2.16]
[null,{"$f":"INDEX(lingue!B258:E258,1,DATOS!$B$5)","v":"Componentes requeridos"},null,{"$f":"INDEX(V2:V4,K12,1)","v":1},null,null,null,null,null,"riemp.",1,80,10,30,null,null,null,"80 VDC",null,null,null,null,null,"MCS",2,"Suspensión 2:1  MCS",null,null,null,null,null,"415x3 VAC"]
[null,{"$f":"INDEX(lingue!B2:E2,1,DATOS!$B$5)","v":"Modelo Piston (9130;9140;9150;MCS;MCE)"},null,{"$f":"INDEX(X2:X13,K13,1)","v":9130},{"$f":"INDEX(Y2:Y13,K13,1)","v":"2"},{"$f":"IF(OR(D7=9130,D7=9150,D7=9140,D7=\"MCE\",D7=\"MCS\",D7=\"CRA\",D7=\"T\",D7=\"HCR-75\"),\"OK\",\"Errore\")","v":"OK"},null,null,null,"bobine",2,85,12,35,null,null,null,"90 VDC",null,null,null,null,null,"MCE",1,"Tiro directo MCE"]
[null,{"$f":"INDEX(lingue!B3:E3,1,DATOS!$B$5)","v":"Suspension (2 2:1) (1 1:1)"},"cm =",{"$f":"$E$7","v":"2"},null,null,null,null,null,"emerg.",{"$f":"IF(D44=\"Lift\",1,2)","v":1},90,8,45,null,null,null,"99 VDC",null,null,null,null,null,"MCS",1,"Tiro directo MCS"]
[null,{"$f":"INDEX(lingue!B4:E4,1,DATOS!$B$5)","v":"Carga"},"Q =",300,"Kg",null,null,null,null,"tens.NTA",1,100,null,55,null,null,null,"110 VDC",null,null,null,null,null,"CRA",2,"Suspension 2:1 CRA"]
[null,{"$f":"INDEX(lingue!B5:E5,1,DATOS!$B$5)","v":"Peso de la cabina y chasis"},"P3 =",450,"Kg",null,null,null,null,"CIF",1,110,null,75,null,null,null,"180 VDC",null,null,null,null,null,"CRA",1,"Tiro directo CRA"]
[null,{"$f":"IF(D13<=1,INDEX(lingue!B6:E6,1,DATOS!$B$5),INDEX(lingue!B7:E7,1,DATOS!$B$5))","v":"Peso de los cables lado cabina"},"Pf =",0,"Kg",null,null,null,null,"prot.stelo",1,120,null,100,null,null,null,"198 VDC",null,null,null,null,null,"HCR-75",2,"Suspensión 2:1 HCR-75"]
[null,{"$f":"IF(D13<=1,INDEX(lingue!B8:E8,1,DATOS!$B$5),INDEX(lingue!B9:E9,1,DATOS!$B$5))","v":"Peso de la polea"},"Prh =",0,"Kg",null,null,null,null,"componente",1,130,null,125,null,null,null,"220 VDC",null,null,null,null,null,"HCR-75",1,"Suspension 1:1 HCR-75"]
[null,{"$f":"INDEX(lingue!B10:E10,1,DATOS!$B$5)","v":"Número de pistones."},"Nr =",1,null,null,null,null,null,"tipo pistone",1,150,null,150,null,null,null,"110 VAC",null,null,null,null,null,"T",1,"Telescopico"]
[null,{"$f":"INDEX(lingue!B11:E11,1,DATOS!$B$5)","v":"Pistón dividido en 1,2,3 piezas"},"n =",1,null,{"$f":"IF(AND(D7=\"HCR-75\",D14>1),\"ERROR\",\"OK\")","v":"OK"},null,null,null,"attacco",{"$f":"IF(D7=9150,2,1)","v":1},160,null,180,null,null,null,"220 VAC"]
[null,{"$f":"INDEX(lingue!B12:E12,1,DATOS!$B$5)","v":"Recorrido de la cabina"},null,2600,"mm",{"$f":"IF(AND(D14>1,D24<70),\"GIUNTA NON POSSIBILE\",\"\")","v":""},null,null,null,"centralina",1,180,null,210]
[null,{"$f":"INDEX(lingue!B13:E13,1,DATOS!$B$5)","v":"Extrarrecorrido  del piston"},null,250,"mm",null,null,null,null,"A.3",1,200,null,250]
[null,{"$f":"INDEX(lingue!B14:E14,1,DATOS!$B$5)","v":"Extrarrecorrido  de la cabina"},null,{"$f":"IF(OR(D7=9130,D7=\"MCE\",D7=\"MCS\",D7=\"T\"),D16*2,D16)","v":500},"mm",null,null,null,null,"tens. KMI",2,"36/60",null,300]
[null,{"$f":"INDEX(lingue!B15:E15,1,DATOS!$B$5)","v":"Recorrido minimo"},null,{"$f":"IF(OR(D14=1,D14=2,D14=3),D15/D8,\"error selección uniones\")","v":1300},"mm",null,null,null,null,"tensione linea",4,"60/80",null,330]
[null,{"$f":"INDEX(lingue!B16:E16,1,DATOS!$B$5)","v":"Dispositivo de guiado (si=2)"},null,1,null,{"$f":"IF(OR(AND(D19=1,D7=9130),AND(D19=2,D7=9130),AND(D19=1,D7=9140),AND(D19=1,D7=9150),AND(D19=1,D7=\"MCE\"),AND(D19=1,D7=\"MCS\"),AND(D19=1,D7=\"CRA\"),AND(D19=1,D7=\"T\"),AND(D19=1,D7=\"HCR-75\")),\"OK\",\"errore\")","v":"OK"},null,null,null,"tubi KMI",2,75,null,380]
[null,{"$f":"INDEX(lingue!B17:E17,1,DATOS!$B$5)","v":"Distancia entre piston y eje polea"},"L1 =",115,"mm",null,null,null,null,"pressostato",1,null,null,440]
[null,{"$f":"INDEX(lingue!B18:E18,1,DATOS!$B$5)","v":"Longitud total de la varilla."},"Lp =",{"$f":"(D15/D8+D16)","v":1550},"mm",{"$f":"IF(OR(D19=1,D19=2),\"OK\", \"Errore\")","v":"OK"},null,null,null,"imballo centr.",1,null,null,500]
[null,{"$f":"INDEX(lingue!B19:E19,1,DATOS!$B$5)","v":"Longitud del pistón cerrado."},"Lt=",{"$f":"IF(D7=\"T\",'EN 81.50 (T)'!C14,IF(OR(D7=\"MCE\",D7=\"MCS\"),D21+'calcoli vari'!B1+IF(AND('accessori centralina'!F10=1,D7=9140),20,0),IF(D7=\"HCR-75\",'EN 81.50 HCR-75'!D18,D21+130*(D19-1)+'calcoli vari'!B1+IF(AND('accessori centralina'!F10=1,D7=9140),20,0))))","v":1750},"mm","Ojo modelo 60/80",null,null,null,"bob HMSV",8,null,null,650]
[null,{"$f":"INDEX(lingue!B20:E20,1,DATOS!$B$5)","v":"Longitud libre de inflexión"},"L1=",{"$f":"IF(D7=\"HCR-75\",'EN 81.50 HCR-75'!D20*10,'EN 81.50'!D19*10)","v":1711},"mm","No aplica en T",null,null,null,"emerg HMSV",{"$f":"IF(D51=\"STD\",K8,2)","v":1}]
[null,{"$f":"INDEX(lingue!B21:E21,1,DATOS!$B$5)","v":"Diametro varilla"},null,{"$f":"INDEX(L2:L19,K2,1)","v":70},"mm",null,null,null,null,"tipo maguera",1]
[null,{"$f":"INDEX(lingue!B22:E22,1,DATOS!$B$5)","v":"Espesor varilla"},null,{"$f":"INDEX(M2:M8,K3,1)","v":5},"mm",{"$f":"IF(AND(D7=\"HCR-75\",D25=7.5,D24=75),\"OK\",\"NOTA->\")","v":"NOTA->"},"Control para HCR-75 SIEMPRE 7,5",null,null,"Frecuencia",1]
[null,{"$f":"INDEX(lingue!B23:E23,1,DATOS!$B$5)","v":"Proteccion "},null,{"$f":"INDEX(U2:U3,K11,1)","v":0},{"$f":"IF(K11=2,INDEX(lingue!B24:E24,1,DATOS!$B$5),\"NO\")","v":"NO"}]
[null,{"$f":"INDEX(lingue!B263:E263,1,DATOS!$B$5)","v":"Entrada de aceite"},null,{"$f":"INDEX(AB2:AB3,K14,1)","v":"Abajo"},null,{"$f":"IF(AND(D7=9150,K14=1),\"Errore\",\"OK\")","v":"OK"}]
[null,{"$f":"INDEX(lingue!B267:E267,1,DATOS!$B$5)","v":"Sistema enmienda A3"},null,{"$f":"INDEX(AD2:AD4,K16,1)","v":"NO"}]
[null,{"$f":"IF(K16=2,INDEX(lingue!B268:E268,1,DATOS!$B$5),INDEX(lingue!B269:E269,1,DATOS!$B$5))","v":"KMI dato no necesario"},null,{"$f":"INDEX(AE2:AE3,K17,1)","v":"24 VDC"}]
[null,{"$f":"IF(AND(D13=1,K16=2),INDEX(lingue!B275:E275,1,DATOS!$B$5),INDEX(lingue!B282:E282,1,DATOS!$B$5))","v":"data input not needed"},null,{"$f":"INDEX('calcoli vari'!A61:A70,K19,1)","v":1},"m"]
[null,{"$f":"IF(K16=3,INDEX(lingue!B288:E288,1,DATOS!$B$5),INDEX(lingue!B290:E290,1,DATOS!$B$5))","v":"door lock valve not requested"},null,{"$f":"INDEX(R2:R14,K22,1)","v":"110 VDC"}]
[null,{"$f":"IF(K16=3,INDEX(lingue!B289:E289,1,DATOS!$B$5),INDEX(lingue!B290:E290,1,DATOS!$B$5))","v":"door lock valve not requested"},null,{"$f":"INDEX(S2:S3,K23,1)","v":"12 VDC"}]
[null,{"$f":"INDEX(lingue!B219:E219,1,DATOS!$B$5)","v":"Carga total sobre el pistón aprox. (kg)"},null,{"$f":"((D9+D10)*D8/D13+D11+D12)","v":1500},"kg"]
[null,{"$f":"INDEX(lingue!B25:E25,1,DATOS!$B$5)","v":"Plena carga"},{"$f":"'EN 81.50'!C25","v":"T ="},{"$f":"IF(D7=\"T\",'EN 81.50 (T)'!C17,IF(D7=\"HCR-75\",'EN 81.50 HCR-75'!D26,'EN 81.50'!D25))","v":1471.5000000000002},{"$f":"'EN 81.50'!E25","v":"daN"},null,null,null,null,"NOTA-1"]
[null,{"$f":"INDEX(lingue!B26:E26,1,DATOS!$B$5)","v":"En vacio"},{"$f":"'EN 81.50'!C26","v":"Tv ="},{"$f":"IF(D7=\"T\",'EN 81.50 (T)'!C18,IF(D7=\"HCR-75\",'EN 81.50 HCR-75'!D27,'EN 81.50'!D26))","v":882.90000000000009},{"$f":"'EN 81.50'!E26","v":"daN"},null,null,null,null,"1- La presión maxima de valvula paracaidas 1-1/4' MORIS y superiores es de 45bar"]
[null,{"$f":"INDEX(lingue!B27:E27,1,DATOS!$B$5)","v":"Carga en punta efectiva"},null,{"$f":"IF(D7=\"T\",'EN 81.50 (T)'!C73,IF(D7=\"HCR-75\",'EN 81.50 HCR-75'!D60,'EN 81.50'!D59))","v":2070.8630611200001},{"$f":"'EN 81.50'!E59","v":"daN"},null,null,null,null,"2- Ojo por encima de 45 bar revisar espesor de camisa de los pistones"]
[null,{"$f":"INDEX(lingue!B28:E28,1,DATOS!$B$5)","v":"Carga máxima admisible"},null,{"$f":"IF(D7=\"T\",'EN 81.50 (T)'!C75,IF(D7=\"HCR-75\",'EN 81.50 HCR-75'!D62,'EN 81.50'!D61))","v":17367.090705723305},{"$f":"'EN 81.50'!E61","v":"daN"},{"$f":"IF(D37<D36,\"ERRORE\",\"OK\")","v":"OK"},null,null,null,"3- La válvula 3/4 MORIS la presión máxima es 80 bar."]
[null,{"$f":"INDEX(lingue!B29:E29,1,DATOS!$B$5)","v":"Coeficiente de seguridad"},null,{"$f":"2*D37/D36","v":16.772804568092045}]
[null,{"$f":"INDEX(lingue!B30:E30,1,DATOS!$B$5)","v":"Presion MAX."},{"$f":"'EN 81.50'!C32","v":"pstat ="},{"$f":"INT(G39+0.5)","v":39},{"$f":"'EN 81.50'!E32","v":"bar"},{"$f":"IF(D39>45,\"NOTA-1\",\"OK\")","v":"OK"},{"$f":"IF(D7=\"T\",'EN 81.50 (T)'!C39,IF(D7=\"HCR-75\",'EN 81.50 HCR-75'!D33,'EN 81.50'!D32))","v":38.686247607281501},"pressione base pistone",null,"NOTA-2"]
[null,{"$f":"INDEX(lingue!B31:E31,1,DATOS!$B$5)","v":"Presion MIN."},{"$f":"'EN 81.50'!C33","v":"pv ="},{"$f":"IF(D7=\"T\",'EN 81.50 (T)'!C40,IF(D7=\"HCR-75\",'EN 81.50 HCR-75'!D34,'EN 81.50'!D33))","v":23.39178238215667},{"$f":"'EN 81.50'!E33","v":"bar"},{"$f":"IF(D40<15,\"NOTA-2\",\"OK\")","v":"OK"},null,null,null,"1- La presión mínima de valvula paracaidas 1-1/4' MORIS y superiores es de 15bar"]
[null,"Dif,.nivelacion por compresion de vacia a cabina llena ","deriva final",{"$f":"'COMPRESIBILIDAD DEL ACEITE'!O8","v":10.042179128374061},"mm",{"$f":"IF(D41>40,\"NOTA-2\",\"OK\")","v":"OK"},null,null,null,"2- Si la deriva es superior a 40mm recomendar un piston de mayor diametro."]
[null,{"$f":"INDEX(lingue!B32:E32,1,DATOS!$B$5)","v":"Potencia motor"},null,null,null,null,null,null,null,"2- Ojo HES -GREENVALVE NO CONVIENE ESTAR POR DEBAJO DE 15bar"]
[null,{"$f":"INDEX(lingue!B33:E33,1,DATOS!$B$5)","v":"Número de centrales"},null,1,null,null,null,null,null,"3- La válvula 3/4 MORIS la presión mínima es 12 bar."]
[null,{"$f":"INDEX(lingue!B35:E35,1,DATOS!$B$5)","v":"Ascensor o HomeLift (Siempre LIFT nuestros HOMELIFT)"},null,{"$f":"INDEX(AC2:AC3,K15,1)","v":"Lift"},null,null,"Para-v-pist",{"$f":"IF(D7=\"HCR-75\",MATCH(D24+5,velocidad!B4:R4,0),MATCH(D24,velocidad!B4:R4,0))","v":4}]
[null,{"$f":"INDEX(lingue!B34:E34,1,DATOS!$B$5)","v":"Bomba"},null,{"$f":"INDEX(N2:N22,K4,1)","v":55},"L/min",null,"Para-v-pump",{"$f":"MATCH(D45,velocidad!A5:A26,0)","v":9}]
[null,{"$f":"INDEX(lingue!B276:E276,1,DATOS!$B$5)","v":"Tension alimentación motor"},null,{"$f":"INDEX(AF2:AF6,K18,1)","v":"400x3 VAC"},null,null,null,{"$f":"IF(RIGHT(D46,4)=\"mono\",\"M\",\"T\")","v":"T"}]
[null,{"$f":"INDEX(lingue!B365:E365,1,DATOS!$B$5)","v":"Frecuencia Motor"},null,{"$f":"INDEX(AK2:AK3,K25,1)","v":50},"Hz",null,"presion",{"$f":"INT(D39-0.1)+1","v":39},null,null,null,null,"se std","se ele","se HL","diam.=70..90","diam.=100","diam.=110..130"]
[null,{"$f":"INDEX(lingue!B37:E37,1,DATOS!$B$5)","v":"Sumergido (O) Aereo (A) HL MORIS"},null,"O",null,{"$f":"IF(AND(D45=30,D49=1,D45=\"HL\"),\"ERRORE\",\"OK\")","v":"OK"},"Para-P-press",{"$f":"MATCH(H47,velocidad!B30:AX30,0)","v":28},"para-p-pump",{"$f":"MATCH(L48,velocidad!A31:A76,0)","v":33},"mod",{"$f":"CONCATENATE(IF((D44=\"HL\"),\"HL\",),D45,H46,IF(AND(D49=2,D44=\"HL\"),\"D\",))","v":"55T"},{"$f":"INDEX(G53:G59,K50,1)","v":"MS-A/K"},{"$f":"INDEX(G53:G57,K50,1)","v":"MS-A/K"},{"$f":"IF(D48=\"O\",P67,IF(D52=\"S\",N67,IF(D52=\"D\",O67,\"verificare olio\")))","v":"HL/OIL-265"},{"$f":"IF(AND(D24<=90,D24>=70),TRUE,FALSE)","v":true},{"$f":"IF(D24=100,TRUE,FALSE)","v":false},{"$f":"IF(AND(D24<=130,D24>=110),TRUE,FALSE)","v":false}]
[null,{"$f":"INDEX(lingue!B38:E38,1,DATOS!$B$5)","v":"1V (1) 2V(2) solo HL"},null,1,null,null,"para olio",{"$f":"IF(D7=\"HCR-75\",MATCH(D24+5,database1!C72:Q72,0),MATCH(D24,database1!C72:Q72,0))","v":4},null,null,null,null,null,null,null,{"$f":"IF(AND(P48,D21>4500,D14=1),TRUE,FALSE)","v":false},{"$f":"IF(AND(Q48,D21>5000,D14=1),TRUE,FALSE)","v":false},{"$f":"IF(AND(R48,D21>6000,D14=1),TRUE,FALSE)","v":false}]
[null,{"$f":"INDEX(lingue!B39:E39,1,DATOS!$B$5)","v":"CIF - central en foso ( 55 a 250 l/min)"},null,{"$f":"INDEX(O2:O3,K10,1)","v":"NO"},null,null,"para cass",{"$f":"MATCH(IF(D52=\"S\",D63+D62,D64+1),H52:H59,1)","v":1},{"$f":"MATCH(D59,I52:I59,1)","v":1},{"$f":"MATCH(D45,J52:J59,1)","v":1},{"$f":"MAX(H50:J50)","v":1}]
[null,{"$f":"INDEX(lingue!B40:E40,1,DATOS!$B$5)","v":"Valvula Estándar (STD) Electronica (ELE)"},null,{"$f":"INDEX(P2:P3,K5,1)","v":"STD"},null,null,null,"litros","potencia","bomba","nivel minimo"]
[null,{"$f":"INDEX(lingue!B41:E41,1,DATOS!$B$5)","v":"simple (S) o doble (D) relleno"},null,{"$f":"INDEX(Q2:Q3,K6,1)","v":"S"},null,{"$f":"IF(AND(D7=\"HCR-75\",D52=\"D\"),\"ERROR\",\"OK\")","v":"OK"},null,0,0,0]
[null,{"$f":"IF(D51=\"STD\",INDEX(lingue!B42:E42,1,DATOS!$B$5),INDEX(lingue!B44:E44,1,DATOS!$B$5))","v":"Tensión bobinas"},null,{"$f":"INDEX(R2:R14,K7,1)","v":"24 VDC"},null,null,"MS-A/K",{"$f":"70*IF(D52=\"D\",0.85,1)","v":70},7.4,100.1,28.5]
[null,{"$f":"IF(D51=\"STD\",INDEX(lingue!B43:E43,1,DATOS!$B$5),INDEX(lingue!B44:E44,1,DATOS!$B$5))","v":"Tensión bobina emergencia"},null,{"$f":"INDEX(S2:S3,K8,1)","v":"12 VDC"},null,null,"MS-A/K",{"$f":"70*IF(D52=\"D\",0.85,1)","v":70},7.4,100.1,30]
[null,{"$f":"IF(D51=\"STD\",INDEX(lingue!B45:E45,1,DATOS!$B$5),INDEX(lingue!B46:E46,1,DATOS!$B$5))","v":"Válvula estándar dato no necesario"},null,{"$f":"INDEX(T2:T3,K9,1)","v":"230 VAC"},null,{"$f":"IF(OR('calcoli vari'!B74=\"x\",'calcoli vari'!B75=\"x\"),\"ERRORE\",\"OK\")","v":"OK"},{"$f":"IF(D51=\"STD\",\"CM-320\",\"CE-320/MB\")","v":"CM-320"},{"$f":"110*IF(D52=\"D\",0.85,1)","v":110},15.1,150.1,40]
[null,{"$f":"INDEX(lingue!B283:E283,1,DATOS!$B$5)","v":"power unit packaging"},null,{"$f":"INDEX(AH2:AH4,K21,1)","v":"standard: with thermoplastic foil"},".",null,{"$f":"IF(D51=\"STD\",\"CM\",\"CE/CM-MB\")","v":"CM"},{"$f":"150*IF(D52=\"D\",0.85,1)","v":150},18.600000000000001,210.1,50]
[null,{"$f":"INDEX(lingue!B47:E47,1,DATOS!$B$5)","v":"Velocidad  pistón"},null,{"$f":"IF(D7=\"T\",'EN 81.50 (T)'!J45/D13*D43,IF($D$47=50,INDEX(velocidad!B5:R26,H45,H44),INDEX(velocidad!W5:AM26,H45,H44))/D13*D43)","v":0.22},"m/s",{"$f":"IF(AND(H46=\"M\",D59>8),\"Errore\",\"OK\")","v":"OK"},{"$f":"IF(D51=\"STD\",\"CA\",\"CE/CA-MB\")","v":"CA"},{"$f":"245*IF(D52=\"D\",0.85,1)","v":245},30.1,{"$f":"IF(D51=\"STD\",250.1,380.1)","v":250.1},55]
[null,{"$f":"INDEX(lingue!B48:E48,1,DATOS!$B$5)","v":"Velocidad cabina"},null,{"$f":"D57*D8","v":0.44},"m/s",null,"CA/A",{"$f":"310*IF(D52=\"D\",0.85,1)","v":310},37.1,380.1,160]
[null,{"$f":"INDEX(lingue!B49:E49,1,DATOS!$B$5)","v":"Potencia motor"},null,{"$f":"IF(D7=\"T\",'EN 81.50 (T)'!J46,IF($D$47=50,INDEX(velocidad!B31:AX76,J48,H48),INDEX(velocidad!B101:AX146,J48,H48)))","v":6},"kW",null,"CG",{"$f":"530*IF(D52=\"D\",0.85,1)","v":530},75.099999999999994,650.1,220]
[null,"Tipo manguera hidraulica",null,{"$f":"INDEX(AJ2:AJ5,$K$24,1)","v":0.31},null,null,{"$f":"IF(D51=\"STD\",\"CIF-2\",\"CE/CIF-2-MB\")","v":"CIF-2"},{"$f":"IF(D51=\"STD\",200,210)","v":200},18.600000000000001,250.1,70]
[null,"Longitud de manguera ",null,5,"m"]
[null,"Aceite en maguera",null,{"$f":"D61*D60","v":1.55},"l"]
[null,{"$f":"INDEX(lingue!B50:E50,1,DATOS!$B$5)","v":"Aceite total en piston"},null,{"$f":"IF(OR(K2=17,K2=16),'EN 81.50 (T)'!J47,IF(D7=\"HCR-75\",D64,IF(D7=\"HCR-75\",0,IF(OR(D7=\"MCS\",D7=\"MCE\"),INDEX(database1!$C$100:$Q$101,1,$H$49)*D21/1000*D13,IF(D7=\"CRA\",INDEX(database1!$C$117:$Q$118,1,$H$49)*D21/1000*D13,INDEX(database1!$C$81:$Q$82,1,$H$49)*D21/1000*D13)))))","v":13.95},"l"]
[null,{"$f":"INDEX(lingue!B51:E51,1,DATOS!$B$5)","v":"Aceite en circulación"},null,{"$f":"IF(OR(K2=16,K2=17),'EN 81.50 (T)'!J48,IF(D7=\"HCR-75\",'EN 81.50 HCR-75'!L25*D21/1000,IF(OR(D7=\"MCS\",D7=\"MCE\"),INDEX(database1!$C$100:$Q$101,2,$H$49)*D21/1000*D13,IF(D7=\"CRA\",INDEX(database1!$C$117:$Q$118,2,$H$49)*D21/1000*D13,INDEX(database1!$C$81:$Q$82,2,$H$49)*D21/1000*D13))))","v":5.9675000000000002},"l"]
[null,{"$f":"INDEX(lingue!B52:E52,1,DATOS!$B$5)","v":"Modelo de central"},null,{"$f":"IF(D50=\"CIF\",G60,IF(D44=\"Lift\",IF(D51=\"STD\",M48,IF(D51=\"ELE\",N48,\"ERRORE\")),IF(D44=\"HL\",O48,\"ERRORE\")))","v":"MS-A/K"},null,null,"para cass",{"$f":"MATCH(D63,H67:H70,1)","v":1},{"$f":"MATCH(D59,I67:I70,1)","v":4},{"$f":"MATCH(D45,J67:J70,1)","v":4},{"$f":"MAX(H65:J65)","v":4}]
[null,null,null,"verifica",{"$f":"'accessori centralina'!E18","v":{"$error":"#N/A"}},null,null,"litri","potenza","pompa","olio base",null,null,"singolo","doppio","oil singolo"]
[null,null,null,null,null,null,null,0,0,0,null,null,null,{"$f":"IF(AND(D63<38,D49=1),\"HL-300\",IF(D63<55,IF(D49=1,\"HL-420\",IF(AND(D49=2,D63<52),\"HL-420-2V\",\"verificare olio\"))))","v":"HL-300"},{"$f":"IF(AND(D64<H68,D49=1),\"HL-300\",IF(D64<H69,IF(D49=1,\"HL-420\",IF(AND(D49=2,D64<H70),\"HL-420-2V\",\"verificare olio\"))))","v":"HL-300"},{"$f":"IF(OR(AND(D63<=H71,D52=\"S\"),AND(D64<=H71,D52=\"D\")),CONCATENATE(\"HL/OIL-265\",IF(D49=2,\"-2V\",\"\")),\"verificare olio\")","v":"HL/OIL-265"}]
[null,{"$f":"CONCATENATE(INDEX(lingue!B53:E53,1,DATOS!$B$5),\"  \",$D$24,\" x \",$D$25,\" x \",$D$21, \"    \",INDEX(lingue!B54:E54,1,DATOS!$B$5),\"  \",$D$14)","v":"Piston  70 x 5 x 1550    Por piezas  1"},null,null,null,null,"HL-300",{"$f":"38*IF(D52=\"D\",0.85,1)","v":38},2.2999999999999998,23.1,4]
[null,{"$f":"CONCATENATE(INDEX(lingue!B55:E55,1,DATOS!$B$5),\"  \",$D$65, \"  \",$D$45,\" x \",$D$59)","v":"Central  MS-A/K  55 x 6"},null,null,null,null,"HL-420",{"$f":"55*IF(D52=\"D\",0.85,1)","v":55},2.2999999999999998,23.1,5]
[null,{"$f":"CONCATENATE(INDEX(lingue!B56:E56,1,DATOS!$B$5),\"   \",$D$58)","v":"Modelo central   0,44"},null,{"$f":"IF($D$47=\"50 Hz\",INDEX(velocidad!B5:P26,H45,H44),INDEX(velocidad!T5:AH26,H45,H44))/D13*D43","v":{"$error":"#VALUE!"}},null,null,"HL-420-2V",{"$f":"52*IF(D52=\"D\",0.85,1)","v":52},3.1,30.1,8]
[null,{"$f":"CONCATENATE(INDEX(lingue!B57:E57,1,DATOS!$B$5),\"  \",D39)","v":"Presion  39"},null,null,null,null,"HL/OIL-265",{"$f":"40*IF(D52=\"D\",0.85,1)","v":40},null,null,9]
[null,null,null,null,null,null,"HL/OIL-265-2V",{"$f":"40*IF(D52=\"D\",0.85,1)","v":40},null,null,9]
[]
[null,{"$f":"CONCATENATE(INDEX(lingue!B58:E58,1,DATOS!$B$5),\"  \",'accessori centralina'!$C$2,\" - \",'accessori centralina'!$H$67)","v":"Descuento  0 - 0"}]
[null,{"$f":"CONCATENATE(INDEX(lingue!B59:E59,1,DATOS!$B$5),\" EUR =  \",'accessori centralina'!$H$68)","v":{"$error":"#N/A"}},null,null,null,null,"tens. valv.",{"$f":"CONCATENATE(D53,IF(D54=\"NO\",\"\",CONCATENATE(\" + \",D54)))","v":"24 VDC + 12 VDC"}]
[null,null,null,null,null,null,"tens. HSV",{"$f":"CONCATENATE(D31,IF(D32=\"NO\",\"\",CONCATENATE(\" + \",D32)))","v":"110 VDC + 12 VDC"}]
[null,{"$f":"CONCATENATE(\"peso piston /i: \",'EN 81.50'!C120,\" kg\")","v":"peso piston /i: 46 kg"},null,null,null,null,"indice centralina",{"$f":"IF(D44=\"Lift\",MATCH(D65,G53:G60,0),MATCH(D65,G68:G72,0))","v":1}]
[null,{"$f":"CONCATENATE(\"peso central/e: \",INDEX('calcoli vari'!B14:B30,'calcoli vari'!B31,1)*D43,\" kg\")","v":{"$error":"#N/A"}}]
[null,{"$f":"CONCATENATE(\"peso piston+central: \",'EN 81.50'!C120+INDEX('calcoli vari'!B14:B30,'calcoli vari'!B31,1)*D43,\" kg\")","v":{"$error":"#N/A"}}]
[]
[null,"aceite necesario para el funcionamiento conexiones incluidas (litros)",null,{"$f":"IF(D44=\"Lift\",INDEX(K53:K60,H77,1)*D43+D63,INDEX(K68:K72,H77,1)*D43+D63)+D62","v":44}]

{"sheet":"accessori vari","index":3,"n_rows":76,"n_cols":6,"rows_kept":76,"cut":false,"hidden":true,"merged":[]}
[4]
[]
[{"$f":"INDEX(lingue!B61:E61,1,'accessori vari'!A1)","v":"Cantidad"},null,1,null,{"$f":"INDEX(lingue!B62:E62,1,'accessori vari'!A1)","v":"Precio"}]
[0,{"$f":"INDEX(lingue!B63:E63,1,'accessori vari'!$A$1)","v":"barra tubo mandata  ø 35 x 2,5 (m 6)"},"5438 / P",{"$f":"'Prezzo P'!C142","v":68},{"$f":"+D4*A4*$C$3","v":0}]
[0,{"$f":"INDEX(lingue!B64:E64,1,'accessori vari'!$A$1)","v":"barra tubo mandata  ø 42 x  3   (m 6)"},"5439 / P",{"$f":"'Prezzo P'!C143","v":97},{"$f":"+D5*A5*$C$3","v":0}]
[0,{"$f":"INDEX(lingue!B65:E65,1,'accessori vari'!$A$1)","v":"Racor a 90º  ø 28 salida vertical en central"},{"$f":"lingue!A65","v":"KIT.RACC/VER28"},{"$f":"'Prezzo P'!C149","v":12},0]
[0,{"$f":"INDEX(lingue!B66:E66,1,'accessori vari'!$A$1)","v":"Racor a 90º  ø 35 salida vertical en central"},{"$f":"lingue!A66","v":"KIT.RACC/VER35"},{"$f":"'Prezzo P'!C150","v":22},0]
[0,{"$f":"INDEX(lingue!B67:E67,1,'accessori vari'!$A$1)","v":"Racor a 90º  ø 42 salida vertical en central"},{"$f":"lingue!A67","v":"KIT.RACC/VER42"},{"$f":"'Prezzo P'!C151","v":29},{"$f":"+D8*A8*$C$3","v":0}]
[0,{"$f":"INDEX(lingue!B68:E68,1,'accessori vari'!$A$1)","v":"Racor a 90º  ø 35 salida horizontal en central"},{"$f":"lingue!A68","v":"KIT.RACC/ORR35"},{"$f":"'Prezzo P'!C152","v":22},{"$f":"+D9*A9*$C$3","v":0}]
[0,{"$f":"INDEX(lingue!B69:E69,1,'accessori vari'!$A$1)","v":"Racor a 90º  ø 42 salida horizontal en central"},{"$f":"lingue!A69","v":"KIT.RACC/ORR42"},{"$f":"'Prezzo P'!C153","v":29},{"$f":"+D10*A10*$C$3","v":0}]
[0,{"$f":"INDEX(lingue!B70:E70,1,'accessori vari'!$A$1)","v":"Racor de conexión directo  ø 35"},5308,{"$f":"'Prezzo P'!C154","v":16},0]
[0,{"$f":"INDEX(lingue!B71:E71,1,'accessori vari'!$A$1)","v":"Racor de conexión directo  ø 42"},5309,{"$f":"'Prezzo P'!C155","v":21},0]
[0,{"$f":"INDEX(lingue!B72:E72,1,'accessori vari'!$A$1)","v":"Racor de conexion directo  ø 35"},5310,{"$f":"'Prezzo P'!C156","v":22},0]
[0,{"$f":"INDEX(lingue!B73:E73,1,'accessori vari'!$A$1)","v":"Racor de conexión a 90º  ø 42"},5311,{"$f":"'Prezzo P'!C157","v":29},0]
[0,{"$f":"INDEX(lingue!B74:E74,1,'accessori vari'!$A$1)","v":"Conexión 3 vias ‘T’   1\" ¼ "},5316,{"$f":"'Prezzo P'!C160","v":59},0]
[0,{"$f":"INDEX(lingue!B75:E75,1,'accessori vari'!$A$1)","v":"Conexión 3 vias  a ‘T’  1\" ½ x 1\" ¼ x 1\" ¼ "},"RACC.T42+2/35",{"$f":"'Prezzo P'!C161","v":70},0]
[0,{"$f":"INDEX(lingue!B76:E76,1,'accessori vari'!$A$1)","v":"Conexión 3 vias‘T’  1\" ½ "},5317,{"$f":"'Prezzo P'!C162","v":70},0]
[0,{"$f":"INDEX(lingue!B77:E77,1,'accessori vari'!$A$1)","v":"Conexión 3 vias  a ‘Y’  1\" ½ x 1\" ¼ x 1\" ¼ "},"0696/2",{"$f":"'Prezzo P'!C163","v":103},0]
[0,{"$f":"INDEX(lingue!B78:E78,1,'accessori vari'!$A$1)","v":"Conexión 3 vias‘Y’  1\" ½ "},"0696/1",{"$f":"'Prezzo P'!C164","v":103},0]
[0,{"$f":"INDEX(lingue!B79:E79,1,'accessori vari'!$A$1)","v":"Conexión 3 vias  a ‘Y’  2\" x 1\" ½  x 1\" ½ "},"0696",{"$f":"'Prezzo P'!C165","v":160},0]
[0,{"$f":"INDEX(lingue!B80:E80,1,'accessori vari'!$A$1)","v":"Conexión 3 vias‘Y’  2\" "},"0696/3",{"$f":"'Prezzo P'!C166","v":177},0]
[0,{"$f":"INDEX(lingue!B81:E81,1,'accessori vari'!$A$1)","v":"Racor 1\"1/4 para conexion a tres vias a Y"},5306,{"$f":"'Prezzo P'!C167","v":20},0]
[0,{"$f":"INDEX(lingue!B82:E82,1,'accessori vari'!$A$1)","v":"Racor 1\"1/2 para conexion a tres vias a Y"},5307,{"$f":"'Prezzo P'!C168","v":20},0]
[0,{"$f":"INDEX(lingue!B83:E83,1,'accessori vari'!$A$1)","v":"Racor 2\" para conexion a tres vias a Y"},5325,{"$f":"'Prezzo P'!C169","v":22},0]
[{"$f":"IF(DATOS!$D$13=2,2,0)","v":0},{"$f":"INDEX(lingue!B84:E84,1,'accessori vari'!$A$1)","v":"tubo miniflex para  valvula paracaidas  ø 8  -5 m "},5425,{"$f":"'Prezzo P'!C170","v":35},0]
[{"$f":"IF(DATOS!$D$13=2,1,0)","v":0},{"$f":"INDEX(lingue!B85:E85,1,'accessori vari'!$A$1)","v":"Conexión tubo miniflex-valvula paracaidas 2 piezas"},"RACC.90/VP-MF",{"$f":"'Prezzo P'!C171","v":6},0]
[{"$f":"IF(DATOS!$D$13=2,1,0)","v":0},{"$f":"INDEX(lingue!B86:E86,1,'accessori vari'!$A$1)","v":"Conexión intermedia tubo miniflex ø 8"},"5307/5",{"$f":"'Prezzo P'!C172","v":3},0]
[]
[null,null,{"$f":"INDEX(lingue!B12:DE212,1,'accessori vari'!$A$1)","v":"Recorrido de la cabina"}]
[0,{"$f":"INDEX(lingue!B91:E91,1,'accessori vari'!$A$1)","v":"tuboflex 3/4 \" diritto-90°"},5,{"$f":"IF(C30=0,0,'Prezzo P'!C131+(C30-1)*'Prezzo P'!C132)","v":85},0]
[0,{"$f":"INDEX(lingue!B92:E92,1,'accessori vari'!$A$1)","v":"tuboflex 3/4 \" diritto-diritto"},0,{"$f":"IF(C31=0,0,'Prezzo P'!C131+(C31-1)*'Prezzo P'!C132)","v":0},0]
[0,{"$f":"INDEX(lingue!B93:E93,1,'accessori vari'!$A$1)","v":"tuboflex 1\" diritto-90°"},5,{"$f":"IF(C32=0,0,'Prezzo P'!C133+(C32-1)*'Prezzo P'!C134)","v":109},0]
[0,{"$f":"INDEX(lingue!B94:E94,1,'accessori vari'!$A$1)","v":"tuboflex 1\" diritto-diritto"},0,{"$f":"IF(C33=0,0,'Prezzo P'!C133+(C33-1)*'Prezzo P'!C134)","v":0},0]
[0,{"$f":"INDEX(lingue!B95:E95,1,'accessori vari'!$A$1)","v":"tuboflex 1\" 1/4 diritto-90°"},5,{"$f":"IF(C34=0,0,'Prezzo P'!C135+(C34-1)*'Prezzo P'!C136)","v":159},0]
[0,{"$f":"INDEX(lingue!B96:E96,1,'accessori vari'!$A$1)","v":"tuboflex 1\" 1/4 diritto-diritto"},0,{"$f":"IF(C35=0,0,'Prezzo P'!C135+(C35-1)*'Prezzo P'!C136)","v":0},0]
[0,{"$f":"INDEX(lingue!B97:E97,1,'accessori vari'!$A$1)","v":"tuboflex 1\" 1/2 diritto-90°"},5,{"$f":"IF(C36=0,0,'Prezzo P'!C137+(C36-1)*'Prezzo P'!C138)","v":217},0]
[0,{"$f":"INDEX(lingue!B98:E98,1,'accessori vari'!$A$1)","v":"tuboflex 1\" 1/2 diritto-diritto"},0,{"$f":"IF(C37=0,0,'Prezzo P'!C137+(C37-1)*'Prezzo P'!C138)","v":0},0]
[0,{"$f":"INDEX(lingue!B99:E99,1,'accessori vari'!$A$1)","v":"tuboflex 2\" diritto-diritto"},0,{"$f":"IF(C38=0,0,'Prezzo P'!C139+(C38-1)*'Prezzo P'!C140)","v":0},0]
[0,{"$f":"INDEX(lingue!B100:E100,1,'accessori vari'!$A$1)","v":"tuboflex 2\" diritto-diritto"},0,{"$f":"IF(C39=0,0,'Prezzo P'!C139+(C39-1)*'Prezzo P'!C140)","v":0},0]
[]
[0,{"$f":"INDEX(lingue!B101:E101,1,'accessori vari'!$A$1)","v":"staffa fissaggio per tubiflex ¾\", 1\" e barre tubo ø 35"},"STAF.TUB.35",{"$f":"'Prezzo P'!C144","v":8},{"$f":"+D41*A41*$C$3","v":0}]
[0,{"$f":"INDEX(lingue!B102:E102,1,'accessori vari'!$A$1)","v":"staffa fissaggio per barre tubo ø 42"},"STAF.TUB.42",{"$f":"'Prezzo P'!C145","v":8},0]
[0,{"$f":"INDEX(lingue!B103:E103,1,'accessori vari'!$A$1)","v":"staffa fissaggio per tuboflex 1\" ¼"},"STAF.TU.1\"1/4",{"$f":"'Prezzo P'!C146","v":8},0]
[0,{"$f":"INDEX(lingue!B104:E104,1,'accessori vari'!$A$1)","v":"staffa fissaggio per tuboflex 1\" ½"},"STAF.TU.1\"1/2",{"$f":"'Prezzo P'!C147","v":8},0]
[0,{"$f":"INDEX(lingue!B105:E105,1,'accessori vari'!$A$1)","v":"staffa fissaggio per tuboflex  2\""},"STAF.TU.2\"G",{"$f":"'Prezzo P'!C148","v":11},0]
[0,{"$f":"INDEX(lingue!B106:E106,1,'accessori vari'!$A$1)","v":"staffa speciale fissaggio per tuboflex  1\" ¼ "},"FAS/FLEX 1\"1/4",13,{"$f":"+D46*A46*$C$3","v":0}]
[0,{"$f":"INDEX(lingue!B107:E107,1,'accessori vari'!$A$1)","v":"staffa speciale fissaggio per tuboflex  1\" ½ "},"FAS/FLEX 1\"1/2",15,{"$f":"+D47*A47*$C$3","v":0}]
[0,{"$f":"INDEX(lingue!B108:E108,1,'accessori vari'!$A$1)","v":"staffa speciale fissaggio per tuboflex  2\" "},"FAS/FLEX 2\"",18,{"$f":"+D48*A48*$C$3","v":0}]
[0,{"$f":"INDEX(lingue!B291:E291,1,'accessori vari'!$A$1)","v":"oil recovery tank for piston, 5 liters"},"TANICA R05 LT",8,{"$f":"+D49*A49*$C$3","v":0}]
[0,{"$f":"INDEX(lingue!B112:E112,1,'accessori vari'!$A$1)","v":"coppia staffe per avvitamento pistone in due pezzi da ø 70 a ø 120"},"0745",{"$f":"'Prezzo P'!C173","v":279},0]
[0,{"$f":"INDEX(lingue!B113:E113,1,'accessori vari'!$A$1)","v":"coppia staffe per avvitamento pistone in due pezzi da ø 130 a ø 200"},"0747",{"$f":"'Prezzo P'!C174","v":321},0]
[0,{"$f":"INDEX(lingue!B114:E114,1,'accessori vari'!$A$1)","v":"carta catramata – rotolo lungh. 10 m largh. 10 cm per pistoni interrati"},"5256/5",{"$f":"'Prezzo P'!C175","v":35},0]
[0,{"$f":"INDEX(lingue!B270:E270,1,'accessori vari'!$A$1)","v":"Complete roomless box for HL-300/AR tank"},"0946/300-COMPL.",{"$f":"'Prezzo P'!C182","v":316},{"$f":"+D53*A53*$C$3","v":0}]
[0,{"$f":"INDEX(lingue!B271:E271,1,'accessori vari'!$A$1)","v":"Complete roomless box for HL-420/AR tank"},"0946/420-COMPL.",{"$f":"'Prezzo P'!C183","v":316},0]
[0,{"$f":"INDEX(lingue!B272:E272,1,'accessori vari'!$A$1)","v":"Complete roomless box for HL-300/AR tank (disassembled version)"},"0946/300-COMPL.SM.",{"$f":"'Prezzo P'!C184","v":324},0]
[0,{"$f":"INDEX(lingue!B273:E273,1,'accessori vari'!$A$1)","v":"Complete roomless box for HL-420/AR tank (disassembled version)"},"0946/420-COMPL.SM.",{"$f":"'Prezzo P'!C185","v":324},0]
[0,{"$f":"INDEX(lingue!B278:E278,1,'accessori vari'!$A$1)","v":"Complete roomless box for HL/OIL-265 tank"},"0946/HL-OIL",{"$f":"'Prezzo P'!C186","v":324},0]
[0,{"$f":"INDEX(lingue!B115:E115,1,'accessori vari'!$A$1)","v":"armadio da assemblare su centralina CM-320/A"},"0884/CM3-A-SC",{"$f":"'Prezzo P'!C176","v":402},0]
[0,{"$f":"INDEX(lingue!B279:E279,1,'accessori vari'!$A$1)","v":"Roomless Box MI-2000 for CM-320/AR color RAL 7035"},"0884/CM3R2A-150",{"$f":"'Prezzo P'!C177","v":598},0]
[0,{"$f":"INDEX(lingue!B117:E117,1,'accessori vari'!$A$1)","v":"armadio – MI 2000 – per CM-320/A colore RAL 7035"},"0884/CM32A-150",{"$f":"'Prezzo P'!C178","v":598},0]
[0,{"$f":"INDEX(lingue!B280:E280,1,'accessori vari'!$A$1)","v":"Roomless Box MI-2000 for CM-320/A color RAL 7035 (disassembled)"},"0884/CM32A-150.SM",{"$f":"'Prezzo P'!C179","v":501},{"$f":"+D61*A61*$C$3","v":0}]
[0,{"$f":"INDEX(lingue!B118:E118,1,'accessori vari'!$A$1)","v":"armadio – MI 2000 CM – per CM colore RAL 7035"},"0884/CMVMO2A-150",{"$f":"'Prezzo P'!C180","v":644},0]
[0,{"$f":"INDEX(lingue!B119:E119,1,'accessori vari'!$A$1)","v":"armadio – MI 2000 CA– per CA colore Ral 7035"},"0884/CAVMO2A",{"$f":"'Prezzo P'!C181","v":697},0]
[0,{"$f":"INDEX(lingue!B120:E120,1,'accessori vari'!$A$1)","v":"loctite 5900 per mi-2000"},"5123/6",37,0]
[0,{"$f":"INDEX(lingue!B121:E121,1,'accessori vari'!$A$1)","v":"Intercambiador de calor  scamb. 5/10 con 2 tubi da mt. 3"},"SCAMB.5/10M-3",{"$f":"'Prezzo P'!C196","v":1382},0]
[0,{"$f":"INDEX(lingue!B122:E122,1,'accessori vari'!$A$1)","v":"Intercambiador de calor  scamb. 20  con 2  tubi da mt. 3"},"SCAMB.20M-3",{"$f":"'Prezzo P'!C197","v":1506},0]
[0,{"$f":"INDEX(lingue!B123:E123,1,'accessori vari'!$A$1)","v":"Intercambiador de calor  scamb. 30 con 2 tubi da mt. 3"},"SCAMB.30M-3",{"$f":"'Prezzo P'!C198","v":1832},0]
[0,{"$f":"INDEX(lingue!B124:E124,1,'accessori vari'!$A$1)","v":"Intercambiador de calor scamb.5/10 con pannello di controllo e 2 tubi mt. 3"},"Scase 5/10",{"$f":"'Prezzo P'!C199","v":1714},{"$f":"+D68*A68*$C$3","v":0}]
[0,{"$f":"INDEX(lingue!B125:E125,1,'accessori vari'!$A$1)","v":"Intercambiador de calor scamb.20 con pannello di controllo e 2 tubi mt. 3"},"Scase 20",{"$f":"'Prezzo P'!C200","v":1961},0]
[0,{"$f":"INDEX(lingue!B126:E126,1,'accessori vari'!$A$1)","v":"Intercambiador de calor scamb.30 con pannello di controllo e 2 tubi mt. 3"},"Scase 30",{"$f":"'Prezzo P'!C201","v":2163},0]
[0,{"$f":"INDEX(lingue!B129:E129,1,'accessori vari'!$A$1)","v":"Documentación técnica (cálculo piston) para verificación por inspector"},null,48,0]
[0,{"$f":"INDEX(lingue!B130:E130,1,'accessori vari'!$A$1)","v":"Consola programación central electrónica"},"MINITERMINAL C",284,{"$f":"+D72*A72*$C$3","v":0},{"$f":"(IF(AND(A72>0,DATOS!D51=\"STD\"),\"ATTENZIONE! VALVOLA STANDARD\",\"\"))","v":""}]
[]
[null,{"$f":"INDEX(lingue!B58:E58,1,'accessori vari'!$A$1)","v":"Descuento"},null,null,{"$f":"'accessori centralina'!H51","v":0}]
[null,{"$f":"INDEX(lingue!B131:E131,1,'accessori vari'!$A$1)","v":"Precio"},null,null,{"$f":"SUM(E4:E72)","v":0}]
[null,{"$f":"INDEX(lingue!B132:E132,1,'accessori vari'!$A$1)","v":"Precio neto."},null,null,{"$f":"+E75*(1-'accessori centralina'!H51/100)","v":0}]

{"sheet":"offerta","index":4,"n_rows":160,"n_cols":8,"rows_kept":160,"cut":false,"hidden":true,"merged":[[7,1,7,5]]}
[]
[]
[]
[]
[]
[]
[]
[null,"Riferimento offerta MORIS:"]
[]
[null,"Att. Sig.",null,null,"fax"]
[null,"Società",null,null,"data",{"$f":"TODAY()","v":"2023-11-30"}]
[null,"Riferimento Cliente",null,null,"pagine",1]
[]
["QT"]
[1,"kit per impianto/i",{"$f":"IF(DATOS!D7=9130,\"in taglia (2:1) tipo 9130\",IF(DATOS!D7=9140,\"diretto laterale (1:1) tipo 9140\",\"diretto centrale (1:1)  tipo 9150\"))","v":"in taglia (2:1) tipo 9130"}]
[null,{"$f":"CONCATENATE(\"portata (kg) \",DATOS!D9,\"; peso cabina, arcata e operatori (kg) \",DATOS!D10)","v":"portata (kg) 300; peso cabina, arcata e operatori (kg) 450"}]
[null,{"$f":"IF(DATOS!D7=9130,\"carico totale su pistone circa (kg)\",\"carico totale sul pistone (kg)\")","v":"carico totale su pistone circa (kg)"},null,{"$f":"DATOS!D33","v":1500}]
[null,{"$f":"CONCATENATE(\"corsa cabina (mm) \",DATOS!D15,\"; extracorsa superiore + inferiore (mm) \",DATOS!D17,\"; velocità (m/s) \", DATOS!D58)","v":"corsa cabina (mm) 2600; extracorsa superiore + inferiore (mm) 500; velocità (m/s) 0,44"}]
[null,{"$f":"IF(A15=1,\"\",\"ciascuno composto da\")","v":""}]
[{"$f":"'accessori centralina'!C3","v":1},{"$f":"CONCATENATE(\"pistone \",DATOS!D7,\" diametro stelo (mm) \",DATOS!D24,\" spessore (mm) \",DATOS!D25,\"; corsa totale pistone (mm) \",DATOS!D21)","v":"pistone 9130 diametro stelo (mm) 70 spessore (mm) 5; corsa totale pistone (mm) 1550"}]
[{"$f":"IF('accessori centralina'!C3=0,0,\"\")","v":""},{"$f":"(IF(DATOS!D19=2,CONCATENATE(\"con dispositivo stelo guidato (collare+dispositivo completo) in \",DATOS!D14,\" pezzo/i\"),CONCATENATE(\"in \",DATOS!D14,\" pezzo/i\")))","v":"in 1 pezzo/i"}]
[{"$f":"IF(OR(DATOS!D26=0,'accessori centralina'!C3=0),0,\"\")","v":0},{"$f":"IF(DATOS!D26=1,\"con anello di protezione stelo\",\"\")","v":""}]
[{"$f":"IF('accessori centralina'!C3=0,0,\"\")","v":""},{"$f":"CONCATENATE(\"lunghezza pistone chiuso (mm) \",DATOS!D22,IF(DATOS!K12=2,CONCATENATE(\"; portata pompa \",DATOS!D45*DATOS!D43,\" l/min\"),\"\"))","v":"lunghezza pistone chiuso (mm) 1750"}]
[{"$f":"A20","v":1},{"$f":" CONCATENATE(\"valvola di blocco tipo \",'calcoli vari'!B87,\" a chiusura totale\",IF(AND(DATOS!K16=2,DATOS!D13=1),\", per KMI\",\"\"),\"; attacco tubazione \", ,'calcoli vari'!B88)","v":"valvola di blocco tipo 1\"1/4 a chiusura totale; attacco tubazione 1\"1/4 metrico (M45x2)"}]
[{"$f":"IF('accessori centralina'!C3=0,0,\"\")","v":""},{"$f":"CONCATENATE(IF(DATOS!D7=9150,\"attacco valvola su pistone: in alto secondo disegno 9150\",IF(DATOS!K14=1,\"attacco valvola su pistone: in basso a 200 mm dal fondo\",\"attacco valvola su pistone: in alto a 400 mm da sommità\")),\", di tipo \",'calcoli vari'!B90)","v":"attacco valvola su pistone: in basso a 200 mm dal fondo, di tipo quadrato"}]
[{"$f":"'accessori centralina'!F10*'accessori centralina'!C3","v":0},{"$f":"'accessori centralina'!A10","v":"Lower piston plate (MI plate)"}]
[{"$f":"'accessori centralina'!C16","v":1},{"$f":"CONCATENATE(IF(DATOS!D51=\"STD\",\"Centralina tipo \",\"Centralina elettronica \"),DATOS!D65,'calcoli vari'!B58,\"; pompa (l/min) \",DATOS!D45,\"; pressione max (bar) \",INT(DATOS!D39-0.5)+1,\"; min (bar) \",INT(DATOS!D40-0.5)+1)","v":"Centralina tipo MS-A/K; pompa (l/min) 55; pressione max (bar) 39; min (bar) 23"}]
[{"$f":"IF('accessori centralina'!C16=0,0,\"\")","v":""},{"$f":"CONCATENATE(\"motore:  potenza (KW) \",'accessori centralina'!B18,\" (HP) \",centraline!F141)","v":"motore:  potenza (KW) 6 (HP) 8"},null,"tensione motore",{"$f":"'calcoli vari'!B50","v":"400/690 VAC, 50 Hz"}]
[{"$f":"IF('accessori centralina'!C16=0,0,\"\")","v":""},{"$f":"CONCATENATE(\"avviamento \",IF('accessori centralina'!F23=1,\"stella triangolo\",\"diretto\"))","v":"avviamento diretto"}]
[{"$f":"IF(AND('accessori centralina'!C16>0,DATOS!D52=\"D\"),\"\",0)","v":0},{"$f":"IF(DATOS!D52=\"D\",\"Attenzione! capacità serbatoio sufficiente per il solo olio in circolo\",\"\")","v":""}]
[{"$f":"IF(AND(LEFT(DATOS!D65,2)=\"HL\",DATOS!K12<>2),\"\",0)","v":0},{"$f":"IF(DATOS!D49=1,\"singola velocità\",IF(DATOS!D49=2,\"doppia velocità\",\"ERRORE\"))","v":"singola velocità"}]
[{"$f":"'accessori centralina'!G23*'accessori centralina'!C16","v":0},"valvola stella triangolo"]
[{"$f":"IF(OR(DATOS!D51=\"STD\",'accessori centralina'!C16=0),0,\"\")","v":0},{"$f":"CONCATENATE(\"valvola CLRV (tensione di alimentazione NTA-2: \",DATOS!D55,\")\")","v":"valvola CLRV (tensione di alimentazione NTA-2: 230 VAC)"}]
[{"$f":"IF(OR(DATOS!D51=\"ELE\",'accessori centralina'!C16=0),0,\"\")","v":""},{"$f":"CONCATENATE(\"tensione elettrovalvole \",DATOS!H75)","v":"tensione elettrovalvole 24 VDC + 12 VDC"},null,null,null,"codice"]
[{"$f":"IF(OR(DATOS!D51=\"STD\",'accessori centralina'!C16=0),0,\"\")","v":0},"con alimentazione di emergenza (+24, 0, -24 VDC)",null,null,null,"codice"]
[{"$f":"IF(AND('accessori centralina'!F22=1,'accessori centralina'!C16>0),\"\",'accessori centralina'!F22*'accessori centralina'!$C$16)","v":0},{"$f":"'accessori centralina'!K22","v":"cassone maggiorato"}]
[{"$f":"'accessori centralina'!F40*'accessori centralina'!C16","v":0},{"$f":"'accessori centralina'!A40","v":"emergency lowering valve 12 VDC for electronic power unit"},null,null,null,{"$f":"'accessori centralina'!I40","v":"MICR.D/250-IN-MB"}]
[{"$f":"'accessori centralina'!F27*'accessori centralina'!C16","v":1},{"$f":"CONCATENATE('accessori centralina'!A27,\" \",'accessori centralina'!E27)","v":"Pressure switch, 5-70 bar, NO+NC, wired as N.C."},null,null,null,{"$f":"'accessori centralina'!I27","v":"5304/1"}]
[{"$f":"'accessori centralina'!F28*'accessori centralina'!$C$16","v":0},{"$f":"'accessori centralina'!A28","v":"Pressure sensor CHD 100 (DINACELL)"},null,null,null,{"$f":"'accessori centralina'!I28","v":"CHD-100"}]
[{"$f":"'accessori centralina'!F29*'accessori centralina'!C16","v":1},{"$f":"'accessori centralina'!A29","v":"hand pump"},null,null,null,{"$f":"'accessori centralina'!I29","v":"POM.MAN.INT"}]
[{"$f":"'accessori centralina'!F31*'accessori centralina'!$C$16","v":0},{"$f":"'accessori centralina'!A31","v":"oil heater 400W 230V for tank"},null,null,null,{"$f":"'accessori centralina'!I31","v":"RIS.CON TER"}]
[{"$f":"'accessori centralina'!F32*'accessori centralina'!$C$16","v":0},{"$f":"'accessori centralina'!A32","v":"oil heater 400W 400V for tank"},null,null,null,{"$f":"'accessori centralina'!I32","v":"RIS.CON TE/400"}]
[{"$f":"'accessori centralina'!F33*'accessori centralina'!$C$16","v":0},{"$f":"'accessori centralina'!A33","v":"oil heater 200W 230V for HL tank"},null,null,null,{"$f":"'accessori centralina'!I33","v":"RIS.CON TE/HL"}]
[{"$f":"'accessori centralina'!F25*'accessori centralina'!$C$16","v":0},{"$f":"'accessori centralina'!A25","v":"internal plate"}]
[{"$f":"'accessori centralina'!F30*'accessori centralina'!C16","v":1},{"$f":"'accessori centralina'!A30","v":"exclusion pressure gauge tap En 81.2"},null,null,null,{"$f":"'accessori centralina'!I30","v":"5377.1"}]
[{"$f":"'accessori centralina'!F26*'accessori centralina'!$C$16","v":0},{"$f":"'accessori centralina'!A26","v":"tank arrangement for heat exchanger"},null,null,null,{"$f":"'accessori centralina'!I26","v":"CASS.PRED.GAR"}]
[{"$f":"'accessori centralina'!F34*'accessori centralina'!$C$16","v":0},{"$f":"'accessori centralina'!A34","v":"soft stop + screw #21 (for 15-250 l/min pumps)"},null,null,null,{"$f":"'accessori centralina'!I34","v":"SOFT STOP 250"}]
[{"$f":"'accessori centralina'!F35*'accessori centralina'!$C$16","v":0},{"$f":"'accessori centralina'!A35","v":"soft stop + screw #21 (for 300-380 l/min pumps)"},null,null,null,{"$f":"'accessori centralina'!I35","v":"SOFT STOP 380/MO"}]
[{"$f":"'accessori centralina'!F36*'accessori centralina'!$C$16","v":0},{"$f":"'accessori centralina'!A36","v":"soft stop + screw #21 (for 440-650 l/min pumps)"},null,null,null,{"$f":"'accessori centralina'!I36","v":"SOFT STOP 650/MO"}]
[{"$f":"'accessori centralina'!F37*'accessori centralina'!$C$16","v":0},{"$f":"'accessori centralina'!A37","v":"down re-levelling electrovalve (for 15 to 250 l/min pumps)"},null,null,null,{"$f":"'accessori centralina'!I37","v":"MICR.D/250-IN"}]
[{"$f":"'accessori centralina'!F38*'accessori centralina'!$C$16","v":0},{"$f":"'accessori centralina'!A38","v":"down re-levelling electrovalve (for 300 to 650 l/min pumps)"},null,null,null,{"$f":"'accessori centralina'!I38","v":"MICR.D/650-IN"}]
[{"$f":"'accessori centralina'!F39*'accessori centralina'!C16","v":0},{"$f":"'accessori centralina'!A39","v":"Bomba de micronivelación 20 l/min - 3 CV"},null,null,null,{"$f":"'accessori centralina'!I39","v":"MICR.COM20/3"}]
[{"$f":"'accessori centralina'!F24*'accessori centralina'!$C$16","v":0},{"$f":"'accessori centralina'!K24","v":"amplificatore protezione motore "},null,null,null,"5001/3"]
[{"$f":"IF(AND(A27>0,DATOS!K21=2),1,0)","v":0},"imballo centralina con bancale fumigato e scatola di cartone"]
[{"$f":"IF(AND(A27>0,DATOS!K21=3),1,0)","v":0},"imballo centralina con cassa di legno compresso"]
[{"$f":"'accessori vari'!A4","v":0},{"$f":"'accessori vari'!B4","v":"barra tubo mandata  ø 35 x 2,5 (m 6)"},null,null,null,{"$f":"'accessori vari'!C4","v":"5438 / P"}]
[{"$f":"'accessori vari'!A5","v":0},{"$f":"'accessori vari'!B5","v":"barra tubo mandata  ø 42 x  3   (m 6)"},null,null,null,{"$f":"'accessori vari'!C5","v":"5439 / P"}]
[{"$f":"'accessori vari'!A30","v":0},{"$f":"CONCATENATE('accessori vari'!B30,\", lunghezza (m) \",'accessori vari'!C30)","v":"tuboflex 3/4 \" diritto-90°, lunghezza (m) 5"}]
[{"$f":"'accessori vari'!A31","v":0},{"$f":"CONCATENATE('accessori vari'!B31,\", lunghezza (m) \",'accessori vari'!C31)","v":"tuboflex 3/4 \" diritto-diritto, lunghezza (m) 0"}]
[{"$f":"'accessori vari'!A32","v":0},{"$f":"CONCATENATE('accessori vari'!B32,\", lunghezza (m) \",'accessori vari'!C32)","v":"tuboflex 1\" diritto-90°, lunghezza (m) 5"}]
[{"$f":"'accessori vari'!A33","v":0},{"$f":"CONCATENATE('accessori vari'!B33,\", lunghezza (m) \",'accessori vari'!C33)","v":"tuboflex 1\" diritto-diritto, lunghezza (m) 0"}]
[{"$f":"'accessori vari'!A34","v":0},{"$f":"CONCATENATE('accessori vari'!B34,\", lunghezza (m) \",'accessori vari'!C34)","v":"tuboflex 1\" 1/4 diritto-90°, lunghezza (m) 5"}]
[{"$f":"'accessori vari'!A35","v":0},{"$f":"CONCATENATE('accessori vari'!B35,\", lunghezza (m) \",'accessori vari'!C35)","v":"tuboflex 1\" 1/4 diritto-diritto, lunghezza (m) 0"}]
[{"$f":"'accessori vari'!A36","v":0},{"$f":"CONCATENATE('accessori vari'!B36,\", lunghezza (m) \",'accessori vari'!C36)","v":"tuboflex 1\" 1/2 diritto-90°, lunghezza (m) 5"}]
[{"$f":"'accessori vari'!A37","v":0},{"$f":"CONCATENATE('accessori vari'!B37,\", lunghezza (m) \",'accessori vari'!C37)","v":"tuboflex 1\" 1/2 diritto-diritto, lunghezza (m) 0"}]
[{"$f":"'accessori vari'!A38","v":0},{"$f":"CONCATENATE('accessori vari'!B38,\", lunghezza (m) \",'accessori vari'!C38)","v":"tuboflex 2\" diritto-diritto, lunghezza (m) 0"}]
[{"$f":"'accessori vari'!A39","v":0},{"$f":"CONCATENATE('accessori vari'!B39,\", lunghezza (m) \",'accessori vari'!C39)","v":"tuboflex 2\" diritto-diritto, lunghezza (m) 0"}]
[{"$f":"'accessori vari'!A25","v":0},{"$f":"'accessori vari'!B25","v":"tubo miniflex para  valvula paracaidas  ø 8  -5 m "},null,null,null,{"$f":"'accessori vari'!C25","v":5425}]
[{"$f":"'accessori vari'!A26","v":0},{"$f":"'accessori vari'!B26","v":"Conexión tubo miniflex-valvula paracaidas 2 piezas"},null,null,null,{"$f":"'accessori vari'!C26","v":"RACC.90/VP-MF"}]
[{"$f":"'accessori vari'!A27","v":0},{"$f":"'accessori vari'!B27","v":"Conexión intermedia tubo miniflex ø 8"},null,null,null,{"$f":"'accessori vari'!C27","v":"5307/5"}]
[{"$f":"'accessori vari'!A11","v":0},{"$f":"'accessori vari'!B11","v":"Racor de conexión directo  ø 35"},null,null,null,{"$f":"'accessori vari'!C11","v":5308}]
[{"$f":"'accessori vari'!A12","v":0},{"$f":"'accessori vari'!B12","v":"Racor de conexión directo  ø 42"},null,null,null,{"$f":"'accessori vari'!C12","v":5309}]
[{"$f":"'accessori vari'!A15","v":0},{"$f":"'accessori vari'!B15","v":"Conexión 3 vias ‘T’   1\" ¼ "},null,null,null,{"$f":"'accessori vari'!C15","v":5316}]
[{"$f":"'accessori vari'!A16","v":0},{"$f":"'accessori vari'!B16","v":"Conexión 3 vias  a ‘T’  1\" ½ x 1\" ¼ x 1\" ¼ "},null,null,null,{"$f":"'accessori vari'!C16","v":"RACC.T42+2/35"}]
[{"$f":"'accessori vari'!A17","v":0},{"$f":"'accessori vari'!B17","v":"Conexión 3 vias‘T’  1\" ½ "},null,null,null,{"$f":"'accessori vari'!C17","v":5317}]
[{"$f":"'accessori vari'!A18","v":0},{"$f":"'accessori vari'!B18","v":"Conexión 3 vias  a ‘Y’  1\" ½ x 1\" ¼ x 1\" ¼ "},null,null,null,{"$f":"'accessori vari'!C18","v":"0696/2"}]
[{"$f":"'accessori vari'!A19","v":0},{"$f":"'accessori vari'!B19","v":"Conexión 3 vias‘Y’  1\" ½ "},null,null,null,{"$f":"'accessori vari'!C19","v":"0696/1"}]
[{"$f":"'accessori vari'!A20","v":0},{"$f":"'accessori vari'!B20","v":"Conexión 3 vias  a ‘Y’  2\" x 1\" ½  x 1\" ½ "},null,null,null,{"$f":"'accessori vari'!C20","v":"0696"}]
[{"$f":"'accessori vari'!A21","v":0},{"$f":"'accessori vari'!B21","v":"Conexión 3 vias‘Y’  2\" "},null,null,null,{"$f":"'accessori vari'!C21","v":"0696/3"}]
[{"$f":"'accessori vari'!A13","v":0},{"$f":"'accessori vari'!B13","v":"Racor de conexion directo  ø 35"},null,null,null,{"$f":"'accessori vari'!C13","v":5310}]
[{"$f":"'accessori vari'!A14","v":0},{"$f":"'accessori vari'!B14","v":"Racor de conexión a 90º  ø 42"},null,null,null,{"$f":"'accessori vari'!C14","v":5311}]
[{"$f":"'accessori vari'!A22","v":0},{"$f":"'accessori vari'!B22","v":"Racor 1\"1/4 para conexion a tres vias a Y"},null,null,null,{"$f":"'accessori vari'!C22","v":5306}]
[{"$f":"'accessori vari'!A23","v":0},{"$f":"'accessori vari'!B23","v":"Racor 1\"1/2 para conexion a tres vias a Y"},null,null,null,{"$f":"'accessori vari'!C23","v":5307}]
[{"$f":"'accessori vari'!A24","v":0},{"$f":"'accessori vari'!B24","v":"Racor 2\" para conexion a tres vias a Y"},null,null,null,{"$f":"'accessori vari'!C24","v":5325}]
[{"$f":"'accessori vari'!A41","v":0},{"$f":"'accessori vari'!B41","v":"staffa fissaggio per tubiflex ¾\", 1\" e barre tubo ø 35"},null,null,null,{"$f":"'accessori vari'!C41","v":"STAF.TUB.35"}]
[{"$f":"'accessori vari'!A42","v":0},{"$f":"'accessori vari'!B42","v":"staffa fissaggio per barre tubo ø 42"},null,null,null,{"$f":"'accessori vari'!C42","v":"STAF.TUB.42"}]
[{"$f":"'accessori vari'!A43","v":0},{"$f":"'accessori vari'!B43","v":"staffa fissaggio per tuboflex 1\" ¼"},null,null,null,{"$f":"'accessori vari'!C43","v":"STAF.TU.1\"1/4"}]
[{"$f":"'accessori vari'!A44","v":0},{"$f":"'accessori vari'!B44","v":"staffa fissaggio per tuboflex 1\" ½"},null,null,null,{"$f":"'accessori vari'!C44","v":"STAF.TU.1\"1/2"}]
[{"$f":"'accessori vari'!A45","v":0},{"$f":"'accessori vari'!B45","v":"staffa fissaggio per tuboflex  2\""},null,null,null,{"$f":"'accessori vari'!C45","v":"STAF.TU.2\"G"}]
[{"$f":"'accessori vari'!A46","v":0},{"$f":"'accessori vari'!B46","v":"staffa speciale fissaggio per tuboflex  1\" ¼ "},null,null,null,{"$f":"'accessori vari'!C46","v":"FAS/FLEX 1\"1/4"}]
[{"$f":"'accessori vari'!A47","v":0},{"$f":"'accessori vari'!B47","v":"staffa speciale fissaggio per tuboflex  1\" ½ "},null,null,null,{"$f":"'accessori vari'!C47","v":"FAS/FLEX 1\"1/2"}]
[{"$f":"'accessori vari'!A48","v":0},{"$f":"'accessori vari'!B48","v":"staffa speciale fissaggio per tuboflex  2\" "},null,null,null,{"$f":"'accessori vari'!C48","v":"FAS/FLEX 2\""}]
[{"$f":"'accessori vari'!A49","v":0},{"$f":"'accessori vari'!B49","v":"oil recovery tank for piston, 5 liters"},null,null,null,{"$f":"'accessori vari'!C49","v":"TANICA R05 LT"}]
[{"$f":"'accessori vari'!A50","v":0},{"$f":"'accessori vari'!B50","v":"coppia staffe per avvitamento pistone in due pezzi da ø 70 a ø 120"},null,null,null,{"$f":"'accessori vari'!C50","v":"0745"}]
[{"$f":"'accessori vari'!A51","v":0},{"$f":"'accessori vari'!B51","v":"coppia staffe per avvitamento pistone in due pezzi da ø 130 a ø 200"},null,null,null,{"$f":"'accessori vari'!C51","v":"0747"}]
[{"$f":"'accessori vari'!A52","v":0},{"$f":"'accessori vari'!B52","v":"carta catramata – rotolo lungh. 10 m largh. 10 cm per pistoni interrati"},null,null,null,{"$f":"'accessori vari'!C52","v":"5256/5"}]
[{"$f":"'accessori vari'!A53","v":0},{"$f":"'accessori vari'!B53","v":"Complete roomless box for HL-300/AR tank"},null,null,null,{"$f":"'accessori vari'!C53","v":"0946/300-COMPL."}]
[{"$f":"'accessori vari'!A54","v":0},{"$f":"'accessori vari'!B54","v":"Complete roomless box for HL-420/AR tank"},null,null,null,{"$f":"'accessori vari'!C54","v":"0946/420-COMPL."}]
[{"$f":"'accessori vari'!A55","v":0},{"$f":"'accessori vari'!B55","v":"Complete roomless box for HL-300/AR tank (disassembled version)"},null,null,null,{"$f":"'accessori vari'!C55","v":"0946/300-COMPL.SM."}]
[{"$f":"'accessori vari'!A56","v":0},{"$f":"'accessori vari'!B56","v":"Complete roomless box for HL-420/AR tank (disassembled version)"},null,null,null,{"$f":"'accessori vari'!C56","v":"0946/420-COMPL.SM."}]
[{"$f":"'accessori vari'!A57","v":0},{"$f":"'accessori vari'!B57","v":"Complete roomless box for HL/OIL-265 tank"},null,null,null,{"$f":"'accessori vari'!C57","v":"0946/HL-OIL"}]
[{"$f":"'accessori vari'!A58","v":0},{"$f":"'accessori vari'!B58","v":"armadio da assemblare su centralina CM-320/A"},null,null,null,{"$f":"'accessori vari'!C58","v":"0884/CM3-A-SC"}]
[{"$f":"'accessori vari'!A59","v":0},{"$f":"'accessori vari'!B59","v":"Roomless Box MI-2000 for CM-320/AR color RAL 7035"},null,null,null,{"$f":"'accessori vari'!C59","v":"0884/CM3R2A-150"}]
[{"$f":"'accessori vari'!A60","v":0},{"$f":"'accessori vari'!B60","v":"armadio – MI 2000 – per CM-320/A colore RAL 7035"},null,null,null,{"$f":"'accessori vari'!C60","v":"0884/CM32A-150"}]
[{"$f":"'accessori vari'!A61","v":0},{"$f":"'accessori vari'!B61","v":"Roomless Box MI-2000 for CM-320/A color RAL 7035 (disassembled)"},null,null,null,{"$f":"'accessori vari'!C61","v":"0884/CM32A-150.SM"}]
[{"$f":"'accessori vari'!A62","v":0},{"$f":"'accessori vari'!B62","v":"armadio – MI 2000 CM – per CM colore RAL 7035"},null,null,null,{"$f":"'accessori vari'!C62","v":"0884/CMVMO2A-150"}]
[{"$f":"'accessori vari'!A63","v":0},{"$f":"'accessori vari'!B63","v":"armadio – MI 2000 CA– per CA colore Ral 7035"},null,null,null,{"$f":"'accessori vari'!C63","v":"0884/CAVMO2A"}]
[{"$f":"'accessori vari'!A64","v":0},{"$f":"'accessori vari'!B64","v":"loctite 5900 per mi-2000"},null,null,null,{"$f":"'accessori vari'!C64","v":"5123/6"}]
[{"$f":"'accessori vari'!A65","v":0},{"$f":"'accessori vari'!B65","v":"Intercambiador de calor  scamb. 5/10 con 2 tubi da mt. 3"},null,null,null,{"$f":"'accessori vari'!C65","v":"SCAMB.5/10M-3"}]
[{"$f":"'accessori vari'!A66","v":0},{"$f":"'accessori vari'!B66","v":"Intercambiador de calor  scamb. 20  con 2  tubi da mt. 3"},null,null,null,{"$f":"'accessori vari'!C66","v":"SCAMB.20M-3"}]
[{"$f":"'accessori vari'!A67","v":0},{"$f":"'accessori vari'!B67","v":"Intercambiador de calor  scamb. 30 con 2 tubi da mt. 3"},null,null,null,{"$f":"'accessori vari'!C67","v":"SCAMB.30M-3"}]
[{"$f":"'accessori vari'!A68","v":0},{"$f":"'accessori vari'!B68","v":"Intercambiador de calor scamb.5/10 con pannello di controllo e 2 tubi mt. 3"},null,null,null,{"$f":"'accessori vari'!C68","v":"Scase 5/10"}]
[{"$f":"'accessori vari'!A69","v":0},{"$f":"'accessori vari'!B69","v":"Intercambiador de calor scamb.20 con pannello di controllo e 2 tubi mt. 3"},null,null,null,{"$f":"'accessori vari'!C69","v":"Scase 20"}]
[{"$f":"'accessori vari'!A70","v":0},{"$f":"'accessori vari'!B70","v":"Intercambiador de calor scamb.30 con pannello di controllo e 2 tubi mt. 3"},null,null,null,{"$f":"'accessori vari'!C70","v":"Scase 30"}]
[{"$f":"'accessori vari'!A71","v":0},{"$f":"'accessori vari'!B71","v":"Documentación técnica (cálculo piston) para verificación por inspector"}]
[{"$f":"'accessori vari'!A72","v":0},{"$f":"'accessori vari'!B72","v":"Consola programación central electrónica"},null,null,null,{"$f":"'accessori vari'!C72","v":"MINITERMINAL C"}]
[{"$f":"'accessori centralina'!F41*$A$15*'accessori centralina'!$C$16","v":0},{"$f":"'accessori centralina'!A41","v":"set of gasket valve block HL"},null,null,null,{"$f":"'accessori centralina'!I41","v":"S.GUA.DIS/HL"}]
[{"$f":"'accessori centralina'!F42*$A$15*'accessori centralina'!$C$16","v":0},{"$f":"'accessori centralina'!A42","v":"set of gasket valve block 15-250 l/m"},null,null,null,{"$f":"'accessori centralina'!I42","v":"S.GUA.DIS/250"}]
[{"$f":"'accessori centralina'!F43*$A$15*'accessori centralina'!$C$16","v":0},{"$f":"'accessori centralina'!A43","v":"set of gasket valve block 300-650 l/m"},null,null,null,{"$f":"'accessori centralina'!I43","v":"S.GUA.DIS/650"}]
[{"$f":"'accessori centralina'!F56","v":0},{"$f":"'accessori centralina'!A56","v":"xxx"}]
[{"$f":"'accessori centralina'!F57","v":0},{"$f":"'accessori centralina'!A57","v":"xxx"}]
[{"$f":"'accessori centralina'!F58","v":0},{"$f":"'accessori centralina'!A58","v":"riduzione valvola di blocco 1\"1/2-1\"1/4 lato tubo"},null,null,null,{"$f":"lingue!A90","v":"5320/COMPLETO"}]
[{"$f":"'accessori centralina'!F59","v":0},{"$f":"'accessori centralina'!A59","v":"raccordo tra valvola di blocco 1\" e tubo 3/4\""},null,null,null,"5320/4"]
[{"$f":"'accessori centralina'!F60","v":0},{"$f":"'accessori centralina'!A60","v":"xxx"}]
[{"$f":"'accessori centralina'!F8*'accessori centralina'!$C$3","v":0},{"$f":"'accessori centralina'!A8","v":"ram head gasket"}]
[{"$f":"'accessori centralina'!F9*'accessori centralina'!$C$3","v":0},{"$f":"'accessori centralina'!A9","v":"set of jack gasket"}]
[{"$f":"'accessori vari'!A6","v":0},{"$f":"'accessori vari'!B6","v":"Racor a 90º  ø 28 salida vertical en central"},null,null,null,{"$f":"'accessori vari'!C6","v":"KIT.RACC/VER28"}]
[{"$f":"'accessori vari'!A7","v":0},{"$f":"'accessori vari'!B7","v":"Racor a 90º  ø 35 salida vertical en central"},null,null,null,{"$f":"'accessori vari'!C7","v":"KIT.RACC/VER35"}]
[{"$f":"'accessori vari'!A8","v":0},{"$f":"'accessori vari'!B8","v":"Racor a 90º  ø 42 salida vertical en central"},null,null,null,{"$f":"'accessori vari'!C8","v":"KIT.RACC/VER42"}]
[{"$f":"'accessori vari'!A9","v":0},{"$f":"'accessori vari'!B9","v":"Racor a 90º  ø 35 salida horizontal en central"},null,null,null,{"$f":"'accessori vari'!C9","v":"KIT.RACC/ORR35"}]
[{"$f":"'accessori vari'!A10","v":0},{"$f":"'accessori vari'!B10","v":"Racor a 90º  ø 42 salida horizontal en central"},null,null,null,{"$f":"'accessori vari'!C10","v":"KIT.RACC/ORR42"}]
[{"$f":"IF(DATOS!K16=2,1,0)","v":0},{"$f":"CONCATENATE(\"kit KMI in centralina per emend. A.3 con tubo da \",DATOS!D30,\" m; tensione \",DATOS!D29)","v":"kit KMI in centralina per emend. A.3 con tubo da 1 m; tensione 24 VDC"}]
[{"$f":"IF(AND(A132=1,DATOS!D13>1),1,0)","v":0},{"$f":"CONCATENATE(\"valvola pilotata di arresto \",INDEX(centraline!C132:F132,1,'accessori centralina'!G21),\" con raccordi su centralina per KMI e doppio pistone\")","v":"valvola pilotata di arresto 1\"1/4 con raccordi su centralina per KMI e doppio pistone"}]
[{"$f":"IF(AND(A132=1,DATOS!D13>1),\" \",0)","v":0},{"$f":"CONCATENATE(\"(codice \",'calcoli vari'!B10,\")\")","v":"(codice KIT.RAC/35KMI-TAN)"}]
[{"$f":"IF(DATOS!K16=3,1,0)","v":0},{"$f":"CONCATENATE(\"dispositivo \",'calcoli vari'!B112,\" per A.3, con bobina \",DATOS!H76)","v":"dispositivo HM-SV 150 B per A.3, con bobina 110 VDC + 12 VDC"},null,null,null,{"$f":"'calcoli vari'!B124","v":"Z000009AA-A0"}]
[]
[null,{"$f":"IF(A139=0,IF($A$15=1,\"prezzo netto *\",\"prezzo netto per ciascun impianto *\"),IF($A$15=1,\"prezzo netto idraulica \",\"prezzo netto idraulica per ciascun impianto \"))","v":"prezzo netto *"},null,null,{"$f":"IF(NOTE!J31=0,'accessori centralina'!H68,\"ATTENZIONE! CONTROLLARE FOGLIO NOTE\")","v":{"$error":"#N/A"}},{"$f":"IF(NOTE!J31=0,\"EUR + IVA\",\"\")","v":"EUR + IVA"}]
[{"$f":"'accessori centralina'!F71","v":0},{"$f":"CONCATENATE(\"colonne guide tipo  \",'accessori centralina'!C71,\"   lungh./cad.  \",'accessori centralina'!D71,\" m\")","v":"colonne guide tipo  aa   lungh./cad.  11 m"},null,null,{"$f":"'accessori centralina'!E71","v":100.54541999999999},"EUR/m + IVA"]
[{"$f":"IF(A138=0,0,'accessori centralina'!F72)","v":0},"kit piastre e bulloni",null,null,{"$f":"'accessori centralina'!E72","v":100.245749},"EUR/cad + IVA"]
[{"$f":"'accessori centralina'!F73","v":0},{"$f":"CONCATENATE(\"bride tipo  \",'accessori centralina'!C73,\"   con grower\")","v":"bride tipo  Tx   con grower"},null,null,{"$f":"'accessori centralina'!E73","v":100},"EUR/cad + IVA"]
[{"$f":"IF(SUM('accessori centralina'!F71:F73)=0,0,\" \")","v":0},"prezzo netto con guide e/o accessori",null,null,{"$f":"'accessori centralina'!H75","v":{"$error":"#N/A"}},"EUR + IVA"]
[null,"consegna *",null,"3/4 settimane"]
[null,"validità offerta",null,"30 giorni"]
[null,"resa",null,"f.co fabbrica"]
[null,"pagamento",null,"solito in uso"]
[]
[]
[null,{"$f":"CONCATENATE(DATOS!B81,\" \",ROUND(DATOS!D81,1))","v":"aceite necesario para el funcionamiento conexiones incluidas (litros) 44"}]
[]
[null,"Distinti saluti",null,"TIMBRO E FIRMA "]
[null,"D. Caprioli",null,"(per accettazione)"]
[null,"davide.caprioli@moris.it"]
[]
["*","Le date di consegna verranno confermate da MORIS per ordini ricevuti in agosto e in dicembre"]
[null,"I cilindri, se in numero maggiore di 2, vengono imballati in cestelli a rendere, dal costo di 30 EUR"]
[]
[]
[]
[]
[null,null,null,null,null,null,null,{"$f":"DATOS!D2","v":"V.14"}]

{"sheet":"Offer","index":5,"n_rows":159,"n_cols":10,"rows_kept":159,"cut":false,"hidden":true,"merged":[[6,1,6,5],[7,1,7,5]]}
[]
[]
[]
[]
[]
[]
[null,null,null,null,null,null,null,null,null,1]
[null,"MORIS reference number:"]
[]
[null,{"$f":"INDEX(lingue!C206:D206,1,Offer!$J$7)","v":"Attention"},null,null,{"$f":"INDEX(lingue!C209:D209,1,Offer!$J$7)","v":"fax"}]
[null,{"$f":"INDEX(lingue!C207:D207,1,Offer!$J$7)","v":"Customer"},null,null,{"$f":"INDEX(lingue!C210:D210,1,Offer!$J$7)","v":"date"},{"$f":"TODAY()","v":"2023-11-30"}]
[null,{"$f":"INDEX(lingue!C208:D208,1,Offer!$J$7)","v":"Customer ref."},null,null,{"$f":"INDEX(lingue!C211:D211,1,Offer!$J$7)","v":"page"},1]
[]
["QT"]
[1,"kit(s) for elevator",{"$f":"IF(DATOS!D7=9130,\"rope side acting ram (2:1), type 9130\",IF(DATOS!D7=9140,\"direct side acting ram (1:1), type 9140\",\"direct central-underground ram (1:1), type  9150\"))","v":"rope side acting ram (2:1), type 9130"}]
[null,{"$f":"CONCATENATE(\"Rated load (Q) = \",DATOS!D9,\" kg    -    total car weight (P) = \",DATOS!D10,\" kg\")","v":"Rated load (Q) = 300 kg    -    total car weight (P) = 450 kg"}]
[null,{"$f":"CONCATENATE(IF(DATOS!D7=9130,\"total load on ram nearly (Kg) \",\"total load on ram (Kg) \"),DATOS!D33)","v":"total load on ram nearly (Kg) 1500"}]
[null,{"$f":"CONCATENATE(\"car stroke \",DATOS!D15,\" mm; total car extrastroke \",DATOS!D17,\" mm; car speed \",DATOS!D58,\" m/s\")","v":"car stroke 2600 mm; total car extrastroke 500 mm; car speed 0,44 m/s"}]
[null,{"$f":"IF(A15=1,\"\",\"each plant is built-up with the following items\")","v":""}]
[{"$f":"'accessori centralina'!C3","v":1},{"$f":"CONCATENATE(\"jack model \",DATOS!D7,\": ram diameter (mm) \",DATOS!D24,\"; rod thickness (mm) \",DATOS!D25,\"; total piston stroke (mm) \",DATOS!D21)","v":"jack model 9130: ram diameter (mm) 70; rod thickness (mm) 5; total piston stroke (mm) 1550"}]
[{"$f":"IF('accessori centralina'!C3=0,0,\"\")","v":""},{"$f":"IF(DATOS!D19=1,CONCATENATE(\"divided in \",DATOS!D14,\" piece/s\"),CONCATENATE(INDEX(lingue!C230:D230,1,Offer!$J$7),,\" divided in \",DATOS!D14,\" piece/s\"))","v":"divided in 1 piece/s"}]
[{"$f":"IF(OR(DATOS!D26=0,'accessori centralina'!C3=0),0,\"\")","v":0},{"$f":"IF(DATOS!D26=1,\"with rod protection ring\",\"\")","v":""}]
[{"$f":"IF('accessori centralina'!C3=0,0,\"\")","v":""},{"$f":"CONCATENATE(\"closed piston length (mm) \",DATOS!D22,IF(DATOS!K12=2,CONCATENATE(\"; pump flow \",DATOS!D45*DATOS!D43,\" l/min\"),\"\"))","v":"closed piston length (mm) 1750"}]
[{"$f":"A20","v":1},{"$f":"CONCATENATE(\"rupture valve type \",'calcoli vari'!B87,\" without hole\",IF(AND(DATOS!K16=2,DATOS!D13=1),\", for KMI\",\"\"),\"; hose connection thread \",'calcoli vari'!B89)","v":"rupture valve type 1\"1/4 without hole; hose connection thread 1\"1/4 metric (M45x2)"}]
[{"$f":"IF('accessori centralina'!C3=0,0,\"\")","v":""},{"$f":"CONCATENATE(IF(DATOS!D7=9150,\"valve connection on piston: on top, according to dwg. 9150\",IF(DATOS!K14=1,\"valve connection on piston: 200 mm from the bottom\",\"valve connection on piston: 400 mm from the top\")),\", \",'calcoli vari'!B91)","v":"valve connection on piston: 200 mm from the bottom, with square flange"}]
[{"$f":"'accessori centralina'!F10*'accessori centralina'!C3","v":0},"Lower piston plate (MI plate)"]
[{"$f":"'accessori centralina'!C16","v":1},{"$f":"CONCATENATE(IF(DATOS!D51=\"ELE\",\"electronic \",\"\"),\"power unit model \",DATOS!D65,'calcoli vari'!B58,\"; pump (l/min) \",DATOS!D45,\"; static pressures (bar): Max = \",INT(DATOS!D39-0.5)+1,\"; Min = \",INT(DATOS!D40-0.5)+1)","v":"power unit model MS-A/K; pump (l/min) 55; static pressures (bar): Max = 39; Min = 23"}]
[{"$f":"IF('accessori centralina'!C16=0,0,\"\")","v":""},{"$f":"CONCATENATE(\"electrical motor: power (kW) \",'accessori centralina'!B18,\"  (HP) \",centraline!F141,\"; voltage \",'calcoli vari'!B50)","v":"electrical motor: power (kW) 6  (HP) 8; voltage 400/690 VAC, 50 Hz"}]
[{"$f":"IF('accessori centralina'!C16=0,0,\"\")","v":""},{"$f":"CONCATENATE(\"starting\",IF('accessori centralina'!F23=0,\" direct\",\" star-delta\"))","v":"starting direct"}]
[{"$f":"IF(AND(LEFT(DATOS!D65,2)=\"HL\",DATOS!K12<>2),\"\",0)","v":0},{"$f":"IF(DATOS!D49=1,\"single speed\",IF(DATOS!D49=2,\"double speed\",\"ERRORE\"))","v":"single speed"}]
[{"$f":"'accessori centralina'!G23*'accessori centralina'!C16","v":0},"star-delta valve"]
[{"$f":"IF(AND('accessori centralina'!C16>0,DATOS!D52=\"D\"),\"\",0)","v":0},{"$f":"IF(DATOS!D52=\"D\",\"Warning! Tank capacity is sufficient only for the circulating oil\",\"\")","v":""}]
[{"$f":"IF(OR(DATOS!D51=\"STD\",'accessori centralina'!C16=0),0,\"\")","v":0},{"$f":"CONCATENATE(\"CLRV valve (NTA-2 power supply voltage \",DATOS!D55,\")\")","v":"CLRV valve (NTA-2 power supply voltage 230 VAC)"}]
[{"$f":"IF(OR(DATOS!D51=\"ELE\",'accessori centralina'!C16=0),0,\"\")","v":""},{"$f":"CONCATENATE(\"valve coil voltage \",DATOS!H75)","v":"valve coil voltage 24 VDC + 12 VDC"},null,null,null,"code"]
[{"$f":"IF(OR(DATOS!D51=\"STD\",'accessori centralina'!C16=0),0,\"\")","v":0},"with emergency power supply input (+24, 0, -24 VDC)",null,null,null,"code"]
[{"$f":"IF(AND('accessori centralina'!F22=1,'accessori centralina'!C16>0),\"\",'accessori centralina'!F22*'accessori centralina'!$C$16)","v":0},"over size tank"]
[{"$f":"offerta!A37","v":0},{"$f":"lingue!C274","v":"emergency lowering valve 12 VDC for electronic power unit"},null,null,null,{"$f":"offerta!F37","v":"MICR.D/250-IN-MB"}]
[{"$f":"offerta!A38","v":1},{"$f":"CONCATENATE(lingue!C166,\" \",'accessori centralina'!E27)","v":"Pressure switch, 5-70 bar, NO+NC, wired as N.C."},null,null,null,{"$f":"offerta!F38","v":"5304/1"}]
[{"$f":"offerta!A39","v":0},"Pressure sensor CHD 100 (DINACELL)",null,null,null,{"$f":"offerta!F39","v":"CHD-100"}]
[{"$f":"offerta!A40","v":1},{"$f":"IF(DATOS!D50=\"CIF\",\"remote hand pump with 5 meter connection hoses\",\"hand pump\")","v":"hand pump"},null,null,null,{"$f":"offerta!F40","v":"POM.MAN.INT"}]
[{"$f":"offerta!A41","v":0},"oil heater 400W 230V for tank",null,null,null,{"$f":"offerta!F41","v":"RIS.CON TER"}]
[{"$f":"offerta!A42","v":0},"oil heater 400W 400V for tank",null,null,null,{"$f":"offerta!F42","v":"RIS.CON TE/400"}]
[{"$f":"offerta!A43","v":0},"oil heater 200W 230V for HL tank",null,null,null,{"$f":"offerta!F43","v":"RIS.CON TE/HL"}]
[{"$f":"offerta!A44","v":0},"internal plate"]
[{"$f":"offerta!A45","v":1},"exclusion pressure gauge tap En 81.2",null,null,null,{"$f":"offerta!F45","v":"5377.1"}]
[{"$f":"offerta!A46","v":0},"tank arrangement for heat exchanger",null,null,null,{"$f":"offerta!F46","v":"CASS.PRED.GAR"}]
[{"$f":"offerta!A47","v":0},"soft stop + screw #21 (for 15-250 l/min pumps)",null,null,null,{"$f":"offerta!F47","v":"SOFT STOP 250"}]
[{"$f":"offerta!A48","v":0},"soft stop + screw #21 (for 300-380 l/min pumps)",null,null,null,{"$f":"offerta!F48","v":"SOFT STOP 380/MO"}]
[{"$f":"offerta!A49","v":0},"soft stop + screw #21 (for 440-650 l/min pumps)",null,null,null,{"$f":"offerta!F49","v":"SOFT STOP 650/MO"}]
[{"$f":"offerta!A50","v":0},"down levelling electrovalve (for 15 to 250 l/min pumps)",null,null,null,{"$f":"offerta!F50","v":"MICR.D/250-IN"}]
[{"$f":"offerta!A51","v":0},"down levelling electrovalve (for 300 to 650 l/min pumps)",null,null,null,{"$f":"offerta!F51","v":"MICR.D/650-IN"}]
[{"$f":"offerta!A52","v":0},"Micro levelling pump flow rate  20  L/M – power 3 HP ",null,null,null,{"$f":"offerta!F52","v":"MICR.COM20/3"}]
[{"$f":"offerta!A53","v":0},"motor protection amplifier",null,null,null,"5001/3"]
[{"$f":"IF(AND(A27>0,DATOS!K21=2),1,0)","v":0},"power unit packaging with cardboard box and fumigated pallet"]
[{"$f":"IF(AND(A27>0,DATOS!K21=3),1,0)","v":0},"power unit packaging with full plywood crate"]
[{"$f":"offerta!A56","v":0},"Steel pipe  ø 35 x 2,5 (m 6)",null,null,null,{"$f":"offerta!F56","v":"5438 / P"}]
[{"$f":"offerta!A57","v":0},"Steel pipe  ø 42 x  3   (m 6)",null,null,null,{"$f":"offerta!F57","v":"5439 / P"}]
[{"$f":"offerta!A58","v":0},{"$f":"CONCATENATE(\"Flexible hose 3/4\"\" straight-90°, length (m) \",'accessori vari'!C30)","v":"Flexible hose 3/4\" straight-90°, length (m) 5"}]
[{"$f":"offerta!A59","v":0},{"$f":"CONCATENATE(\"Flexible hose 3/4\"\" straight-straight, length (m) \",'accessori vari'!C31)","v":"Flexible hose 3/4\" straight-straight, length (m) 0"}]
[{"$f":"offerta!A60","v":0},{"$f":"CONCATENATE(\"Flexible hose 1\"\" straight-90°, length (m) \",'accessori vari'!C32)","v":"Flexible hose 1\" straight-90°, length (m) 5"}]
[{"$f":"offerta!A61","v":0},{"$f":"CONCATENATE(\"Flexible hose 1\"\" straight-straight, length (m) \",'accessori vari'!C33)","v":"Flexible hose 1\" straight-straight, length (m) 0"}]
[{"$f":"offerta!A62","v":0},{"$f":"CONCATENATE(\"Flexible hose 1\"\" 1/4 straight-90°, length (m) \",'accessori vari'!C34)","v":"Flexible hose 1\" 1/4 straight-90°, length (m) 5"}]
[{"$f":"offerta!A63","v":0},{"$f":"CONCATENATE(\"Flexible hose 1\"\" 1/4 straight-straight, length (m) \",'accessori vari'!C35)","v":"Flexible hose 1\" 1/4 straight-straight, length (m) 0"}]
[{"$f":"offerta!A64","v":0},{"$f":"CONCATENATE(\"Flexible hose 1\"\" 1/2 straight-90°, length (m) \",'accessori vari'!C36)","v":"Flexible hose 1\" 1/2 straight-90°, length (m) 5"}]
[{"$f":"offerta!A65","v":0},{"$f":"CONCATENATE(\"Flexible hose 1\"\" 1/2 straight-straight, length (m) \",'accessori vari'!C37)","v":"Flexible hose 1\" 1/2 straight-straight, length (m) 0"}]
[{"$f":"offerta!A66","v":0},{"$f":"CONCATENATE(\"Flexible hose 2\"\" straight-straight, length (m) \",'accessori vari'!C38)","v":"Flexible hose 2\" straight-straight, length (m) 0"}]
[{"$f":"offerta!A67","v":0},{"$f":"CONCATENATE(\"Flexible hose 2\"\" straight-straight, length (m) \",'accessori vari'!C39)","v":"Flexible hose 2\" straight-straight, length (m) 0"}]
[{"$f":"offerta!A68","v":0},"Hose to balance rupture valve  ø 8  - m 5",null,null,null,{"$f":"offerta!F68","v":5425}]
[{"$f":"offerta!A69","v":0},"Connection between hose and rupture valve (2 pieces)",null,null,null,{"$f":"offerta!F69","v":"RACC.90/VP-MF"}]
[{"$f":"offerta!A70","v":0},"Connection between 2 hoses ø 8  - m 5",null,null,null,{"$f":"offerta!F70","v":"5307/5"}]
[{"$f":"offerta!A71","v":0},"Straight connection  ø 35",null,null,null,{"$f":"offerta!F71","v":5308}]
[{"$f":"offerta!A72","v":0},"Straight connection  ø 42",null,null,null,{"$f":"offerta!F72","v":5309}]
[{"$f":"offerta!A73","v":0},"3 way T connection  1\" ¼ ",null,null,null,{"$f":"offerta!F73","v":5316}]
[{"$f":"offerta!A74","v":0},"3 way T connection  1\" ½  x 1\" ¼  x 1\" ¼",null,null,null,{"$f":"offerta!F74","v":"RACC.T42+2/35"}]
[{"$f":"offerta!A75","v":0},"3 way T connection  1\" ½",null,null,null,{"$f":"offerta!F75","v":5317}]
[{"$f":"offerta!A76","v":0},"3 way Y connection  1\" ½ x  1\" ¼ x 1\" ¼",null,null,null,{"$f":"offerta!F76","v":"0696/2"}]
[{"$f":"offerta!A77","v":0},"3 way Y connection  1\" ½ ",null,null,null,{"$f":"offerta!F77","v":"0696/1"}]
[{"$f":"offerta!A78","v":0},"3 way Y connection  2\" x 1\" ½  x 1\" ½",null,null,null,{"$f":"offerta!F78","v":"0696"}]
[{"$f":"offerta!A79","v":0},"3 way Y connection  2\" ",null,null,null,{"$f":"offerta!F79","v":"0696/3"}]
[{"$f":"offerta!A80","v":0},"Elbow connection 90 °  ø 35",null,null,null,{"$f":"offerta!F80","v":5310}]
[{"$f":"offerta!A81","v":0},"Elbow connection 90 °  ø 42",null,null,null,{"$f":"offerta!F81","v":5311}]
[{"$f":"offerta!A82","v":0},"Nipplo 1\"1/4 for 3 way Y connection ",null,null,null,{"$f":"offerta!F82","v":5306}]
[{"$f":"offerta!A83","v":0},"Nipplo 1\"1/2 for 3 way Y connection ",null,null,null,{"$f":"offerta!F83","v":5307}]
[{"$f":"offerta!A84","v":0},"Nipplo 2\" for 3 way Y connection ",null,null,null,{"$f":"offerta!F84","v":5325}]
[{"$f":"offerta!A85","v":0},"Fixation for hoses ¾\", 1\" and steel pipes ø 35",null,null,null,{"$f":"'accessori vari'!C41","v":"STAF.TUB.35"}]
[{"$f":"offerta!A86","v":0},"Fixation for steel pipe  ø 42",null,null,null,{"$f":"'accessori vari'!C42","v":"STAF.TUB.42"}]
[{"$f":"offerta!A87","v":0},"Fixation for rubber hose 1\" ¼",null,null,null,{"$f":"'accessori vari'!C43","v":"STAF.TU.1\"1/4"}]
[{"$f":"offerta!A88","v":0},"Fixation for rubber hose 1\" ½",null,null,null,{"$f":"'accessori vari'!C44","v":"STAF.TU.1\"1/2"}]
[{"$f":"offerta!A89","v":0},"Fixation for rubber pipe 2\"",null,null,null,{"$f":"'accessori vari'!C45","v":"STAF.TU.2\"G"}]
[{"$f":"offerta!A90","v":0},"Bracket - hose 1\" 1/4",null,null,null,{"$f":"'accessori vari'!C46","v":"FAS/FLEX 1\"1/4"}]
[{"$f":"offerta!A91","v":0},"Bracket - hose 1\" 1/2",null,null,null,{"$f":"'accessori vari'!C47","v":"FAS/FLEX 1\"1/2"}]
[{"$f":"offerta!A92","v":0},"Bracket - hose 2\"",null,null,null,{"$f":"'accessori vari'!C48","v":"FAS/FLEX 2\""}]
[{"$f":"offerta!A93","v":0},"oil recovery tank for piston, 5 liters",null,null,null,{"$f":"offerta!F93","v":"TANICA R05 LT"}]
[{"$f":"offerta!A94","v":0},"Tie kit to screw ram in 2 pieces from  ø 70 to ø 120",null,null,null,{"$f":"offerta!F94","v":"0745"}]
[{"$f":"offerta!A95","v":0},"Tie kit to screw ram in 2 pieces from ø 130 to ø 200",null,null,null,{"$f":"offerta!F95","v":"0747"}]
[{"$f":"offerta!A96","v":0},{"$f":"lingue!C114","v":"Roll of Tar paper, length 10 m width 10 cm for underground pistons"},null,null,null,{"$f":"offerta!F96","v":"5256/5"}]
[{"$f":"offerta!A97","v":0},"Complete roomless box for HL-300/AR tank",null,null,null,{"$f":"offerta!F97","v":"0946/300-COMPL."}]
[{"$f":"offerta!A98","v":0},"Complete roomless box for HL-420/AR tank",null,null,null,{"$f":"offerta!F98","v":"0946/420-COMPL."}]
[{"$f":"offerta!A99","v":0},"Complete roomless box for HL-300/AR tank (disassembled version)",null,null,null,{"$f":"offerta!F99","v":"0946/300-COMPL.SM."}]
[{"$f":"offerta!A100","v":0},"Complete roomless box for HL-420/AR tank (disassembled version)",null,null,null,{"$f":"offerta!F100","v":"0946/420-COMPL.SM."}]
[{"$f":"offerta!A101","v":0},{"$f":"lingue!C278","v":"Complete roomless box for HL/OIL-265 tank"},null,null,null,{"$f":"offerta!F101","v":"0946/HL-OIL"}]
[{"$f":"offerta!A102","v":0},"Roomless Box to be assembled on tank CM-320/A",null,null,null,{"$f":"offerta!F102","v":"0884/CM3-A-SC"}]
[{"$f":"offerta!A103","v":0},{"$f":"lingue!C279","v":"Roomless Box MI-2000 for CM-320/AR color RAL 7035"},null,null,null,{"$f":"offerta!F103","v":"0884/CM3R2A-150"}]
[{"$f":"offerta!A104","v":0},{"$f":"lingue!C117","v":"Roomless Box MI-2000 for CM-320/A color RAL 7035"},null,null,null,{"$f":"offerta!F104","v":"0884/CM32A-150"}]
[{"$f":"offerta!A105","v":0},{"$f":"lingue!C280","v":"Roomless Box MI-2000 for CM-320/A color RAL 7035 (disassembled)"},null,null,null,{"$f":"offerta!F105","v":"0884/CM32A-150.SM"}]
[{"$f":"offerta!A106","v":0},"Roomless Box MI-2000 for CM color RAL 7035",null,null,null,{"$f":"offerta!F106","v":"0884/CMVMO2A-150"}]
[{"$f":"offerta!A107","v":0},"Roomless Box MI-2000 for CA color RAL 7035",null,null,null,{"$f":"offerta!F107","v":"0884/CAVMO2A"}]
[{"$f":"offerta!A108","v":0},"Loctite 5900 (for Box MI-2000)",null,null,null,{"$f":"offerta!F108","v":"5123/6"}]
[{"$f":"offerta!A109","v":0},"Heat exchanger SCAMB. 5/10 with 2 rubber pipe 3 m",null,null,null,{"$f":"offerta!F109","v":"SCAMB.5/10M-3"}]
[{"$f":"offerta!A110","v":0},"Heat exchanger SCAMB. 20   with 2 rubber pipe 3m",null,null,null,{"$f":"offerta!F110","v":"SCAMB.20M-3"}]
[{"$f":"offerta!A111","v":0},"Heat exchanger SCAMB. 30 with 2 rubber pipe 3m",null,null,null,{"$f":"offerta!F111","v":"SCAMB.30M-3"}]
[{"$f":"offerta!A112","v":0},"Heat exchanger SCAMB.5/10 with control box, 2 rubber pipe 3m",null,null,null,{"$f":"offerta!F112","v":"Scase 5/10"}]
[{"$f":"offerta!A113","v":0},"Heat exchanger SCAMB.20 with control box, 2 rubber pipe 3m",null,null,null,{"$f":"offerta!F113","v":"Scase 20"}]
[{"$f":"offerta!A114","v":0},"Heat exchanger SCAMB.30 with control box, 2 rubber pipe 3m",null,null,null,{"$f":"offerta!F114","v":"Scase 30"}]
[{"$f":"offerta!A115","v":0},"Technical documentation (jack calculation) for final inspection"]
[{"$f":"offerta!A116","v":0},"Programming keyboard for Electronic power unit",null,null,null,{"$f":"'accessori vari'!C72","v":"MINITERMINAL C"}]
[{"$f":"offerta!A117","v":0},"set of gasket valve block HL",null,null,null,{"$f":"offerta!F117","v":"S.GUA.DIS/HL"}]
[{"$f":"offerta!A118","v":0},"set of gasket valve block 15-250 l/m",null,null,null,{"$f":"offerta!F118","v":"S.GUA.DIS/250"}]
[{"$f":"offerta!A119","v":0},"set of gasket valve block 300-650 l/m",null,null,null,{"$f":"offerta!F119","v":"S.GUA.DIS/650"}]
[{"$f":"offerta!A120","v":0},"xxx",null,null,null,{"$f":"offerta!F120","v":0}]
[{"$f":"offerta!A121","v":0},"xxx",null,null,null,{"$f":"offerta!F121","v":0}]
[{"$f":"offerta!A122","v":0},"reduction rupture valve 1\"1/2-1\"1/4 side hose",null,null,null,{"$f":"offerta!F122","v":"5320/COMPLETO"}]
[{"$f":"offerta!A123","v":0},"reduction between rupture valve 1\" and hose 3/4\"",null,null,null,{"$f":"offerta!F123","v":"5320/4"}]
[{"$f":"offerta!A124","v":0},"xxx"]
[{"$f":"offerta!A125","v":0},"ram head gasket"]
[{"$f":"offerta!A126","v":0},"set of jack gasket"]
[{"$f":"'accessori vari'!A6","v":0},"Elbow connection 90 °  ø 28 vertical exit power unit",null,null,null,{"$f":"'accessori vari'!C6","v":"KIT.RACC/VER28"}]
[{"$f":"'accessori vari'!A7","v":0},"Elbow connection 90 °  ø 35 vertical exit power unit",null,null,null,{"$f":"'accessori vari'!C7","v":"KIT.RACC/VER35"}]
[{"$f":"'accessori vari'!A8","v":0},"Elbow connection 90 °  ø 42 vertical exit power unit",null,null,null,{"$f":"'accessori vari'!C8","v":"KIT.RACC/VER42"}]
[{"$f":"'accessori vari'!A9","v":0},"Elbow connection 90 °  ø 35 horizontal exit power unit",null,null,null,{"$f":"'accessori vari'!C9","v":"KIT.RACC/ORR35"}]
[{"$f":"'accessori vari'!A10","v":0},"Elbow connection 90 °  ø 42 horizontal exit power unit",null,null,null,{"$f":"'accessori vari'!C10","v":"KIT.RACC/ORR42"}]
[{"$f":"IF(DATOS!K16=2,1,0)","v":0},{"$f":"CONCATENATE(\"KMI kit for A.3 amend. inside power unit, with \",DATOS!D30,\" m hose; voltage \",DATOS!D29)","v":"KMI kit for A.3 amend. inside power unit, with 1 m hose; voltage 24 VDC"}]
[{"$f":"IF(AND(A132=1,DATOS!D13>1),1,0)","v":0},{"$f":"CONCATENATE(\"piloted stop valve \",INDEX(centraline!C132:F132,1,'accessori centralina'!G21),\" with fittings on tank for KMI and twin pistons\")","v":"piloted stop valve 1\"1/4 with fittings on tank for KMI and twin pistons"},null,null,null,{"$f":"'calcoli vari'!B10","v":"KIT.RAC/35KMI-TAN"}]
[{"$f":"IF(DATOS!K16=3,1,0)","v":0},{"$f":"CONCATENATE('calcoli vari'!B112,\" device for A.3, with coil \",DATOS!H76)","v":"HM-SV 150 B device for A.3, with coil 110 VDC + 12 VDC"},null,null,null,{"$f":"'calcoli vari'!B124","v":"Z000009AA-A0"}]
[]
[null,{"$f":"IF(A15=1,\"Price Hydraulic *\",\"Price Hydraulic for each plant\")","v":"Price Hydraulic *"},null,null,{"$f":"IF(NOTE!J31=0,'accessori centralina'!H68,\"WARNING! CHECK 'NOTE' SHEET\")","v":{"$error":"#N/A"}},{"$f":"IF(NOTE!J31=0,\"EUR\",\"\")","v":"EUR"}]
[{"$f":"'accessori centralina'!F71","v":0},{"$f":"CONCATENATE(\"column guide type \",'accessori centralina'!C71,\" length/each m \",'accessori centralina'!D71)","v":"column guide type aa length/each m 11"},null,null,{"$f":"offerta!E138","v":100.54541999999999},"  EUR/m"]
[{"$f":"'accessori centralina'!F72","v":0},"fish plate kits",null,null,{"$f":"offerta!E139","v":100.245749},"  EUR/each"]
[{"$f":"'accessori centralina'!F73","v":0},{"$f":"CONCATENATE(\"clips, type  \",'accessori centralina'!C73,\"  with locknut\")","v":"clips, type  Tx  with locknut"},null,null,{"$f":"offerta!E140","v":100},"  EUR/each"]
[{"$f":"IF(A138=0,0,\"\")","v":0},null,null,"Total amount",{"$f":"'accessori centralina'!H75","v":{"$error":"#N/A"}},"EUR"]
[null,"price quoted",null,"Ex Works"]
[null,"Delivery time *",null,"3/4 weeks"]
[null,"Quotation validity",null,"30 days"]
[null,"Payment",null,"same in use"]
[]
[]
[null,{"$f":"CONCATENATE(\"oil to be purchased, needed for the lift to work (excluding hoses) \",ROUND(DATOS!D81,1),\" (liters)\")","v":"oil to be purchased, needed for the lift to work (excluding hoses) 44 (liters)"}]
[]
[null,"Best Regards"]
[null,"D. Caprioli"]
[null,"davide.caprioli@moris.it"]
[]
["*","Delivery time in August or second second half of Dec. shall be confirmed after the receipt of the order."]
[null,"Cylinders, if more than 2, will be packaged in re-usable U-brackets, with a cost of 30 EUR per package"]
[]
[]
[]
[]
[null,null,null,null,null,null,null,{"$f":"DATOS!D2","v":"V.14"}]

{"sheet":"NOTE","index":6,"n_rows":31,"n_cols":11,"rows_kept":31,"cut":false,"hidden":true,"merged":[]}
["ANOMALIE RISCONTRATE - ERROR CHECK"]
[]
[{"$f":"IF(J3=0,\"\",\"Cassone maggiorato non disponibile con centralina elettronica o centralina in fossa\")","v":""},null,null,null,null,null,null,null,null,{"$f":"IF(AND(OR(DATOS!D51=\"ELE\",DATOS!D50=\"CIF\"),'accessori centralina'!F22<>0),1,0)","v":0},"centralina elettronica/centralina in fossa e cassone maggiorato"]
[{"$f":"IF(J3=0,\"\",\"Oversize tank not available with electronic valve or power unit in the tank\")","v":""}]
[{"$f":"IF(J5=0,\"\",\"Centralina in fossa solo per 55-250 litri/min\")","v":""},null,null,null,null,null,null,null,null,{"$f":"IF(AND(OR(DATOS!D45<55,DATOS!D45>250),DATOS!D50=\"CIF\"),1,0)","v":0},"CIF e portata pompa"]
[{"$f":"IF(J5=0,\"\",\"Power unit in the pit available only for 55-250 lit/min\")","v":""}]
[{"$f":"IF(J7=0,\"\",\"La pressione statica massima deve essere pari inferiore a 45 bar\")","v":""},null,null,null,null,null,null,null,null,{"$f":"IF(DATOS!D39>45,1,0)","v":0},"pressione statica massima"]
[{"$f":"IF(J7=0,\"\",\"Max static pressure must be equal or lower than 45 bar\")","v":""}]
[{"$f":"IF(J9=0,\"\",\"La pressione statica a vuoto deve essere pari o superiore a 12 bar\")","v":""},null,null,null,null,null,null,null,null,{"$f":"IF(DATOS!D40<12,1,0)","v":0},"pressione statica minima"]
[{"$f":"IF(J9=0,\"\",\"Minimum pressure with empty car must be equal or greater than 12 bar\")","v":""}]
[{"$f":"IF(J11=0,\"\",\"La lunghezza massima della singola verga di tubo è di 11 metri. Contattate MORIS\")","v":""},null,null,null,null,null,null,null,null,{"$f":"IF(DATOS!D22/DATOS!D14>11000,1,0)","v":0},"lunghezza MAX verga"]
[{"$f":"IF(J11=0,\"\",\"The maximum length of each piston section is 11 meters. Please contact MORIS\")","v":""}]
[{"$f":"IF(J13=0,\"\",\"Stabilità non verificata; incrementare diametro o spessore pistone\")","v":""},null,null,null,null,null,null,null,null,{"$f":"IF(DATOS!D38<2,1,0)","v":0},"coefficiente di stabilità"]
[{"$f":"IF(J13=0,\"\",\"Stability is not verified; please increase piston diameter or thickness\")","v":""}]
[{"$f":"IF(J15=0,\"\",\"Dispositivo Guida Stelo solo per pistoni in taglia e diam. da 80 a 160 mm\")","v":""},null,null,null,null,null,null,null,null,{"$f":"IF(AND(DATOS!D19=2,OR(DATOS!D7<>9130,DATOS!D24<80,DATOS!D24>160)),1,0)","v":0},"guida stelo: solo su certi diametri e 2:1"]
[{"$f":"IF(J15=0,\"\",\"Guided Ram device only for roped elevators and diam. 80 to 160 mm\")","v":""}]
[{"$f":"IF(J17=0,\"\",\"Giunzione pistone o anello di protezione stelo solo per diam. 70 mm e superiori\")","v":""},null,null,null,null,null,null,null,null,{"$f":"IF(AND(DATOS!D24<=60,OR(DATOS!D14>2,DATOS!D26>0)),1,0)","v":0},"anello protezione e giunzione non per 50 e 60 mm"]
[{"$f":"IF(J17=0,\"\",\"Piston junctions or rod protection ring not vailable for 50 and 60 mm pistons\")","v":""}]
[{"$f":"IF(J19=0,\"\",\"anello di protezione stelo disponibile solo per pisotni in 1 pezzo\")","v":""},null,null,null,null,null,null,null,null,{"$f":"IF(DATOS!D14*DATOS!D26>1,1,0)","v":0},"anello di protezione non in 2 pezzi"]
[{"$f":"IF(J19=0,\"\",\"rod protection ring available for single-section pistons\")","v":""}]
[{"$f":"IF(J21=0,\"\",\"pistone diretto centrale: attacco solo in alto\")","v":""},null,null,null,null,null,null,null,null,{"$f":"IF(AND(DATOS!D7=9150,DATOS!K14=1),1,0)","v":0},"pistone 9150 con attacco in basso"]
[{"$f":"IF(J21=0,\"\",\"underground 1:1 piston: the oil inlet is only on top\")","v":""}]
[{"$f":"IF(J23=0,\"\",\"imballo scelto non è disponibile per il modello della centralina\")","v":""},null,null,null,null,null,null,null,null,{"$f":"IF(OR('calcoli vari'!B74=\"x\",'calcoli vari'!B75=\"x\"),1,0)","v":0},"imballo non disponibile per centralina scelta"]
[{"$f":"IF(J23=0,\"\",\"the selected power pack packaging is not available for the selected tank\")","v":""}]
[{"$f":"IF(J25=0,\"\",\"la pressione statica minima è troppo bassa per il funzionamento della door lock valve\")","v":""},null,null,null,null,null,null,null,null,{"$f":"IF(AND(DATOS!K16=3,'calcoli vari'!B104=0),1,0)","v":0},"pressione minima troppo bassa per door lock valve"]
[{"$f":"IF(J25=0,\"\",\"the minimum static pressure is too low for the door lock valve operations\")","v":""}]
[{"$f":"IF(J27=0,\"\",\"la door lock valve HMSV/HSV è utilizzabile fino a 440 l/min; contattare MORIS\")","v":""},null,null,null,null,null,null,null,null,{"$f":"IF(AND(DATOS!K16=3,DATOS!D45>440),1,0)","v":0},"portata pompa troppo alta per HSV"]
[{"$f":"IF(J27=0,\"\",\"the HMSV/HSV door lock valve is suitable up to 440 l/min; contact MORIS\")","v":""}]
[]
[]
[null,null,null,null,null,null,null,null,null,{"$f":"SUM(J3:J30)","v":0},"errori"]

{"sheet":"calcoli vari","index":7,"n_rows":124,"n_cols":6,"rows_kept":124,"cut":false,"hidden":false,"merged":[]}
["Qf",{"$f":"IF(OR(DATOS!D7=\"MCE\",DATOS!D7=\"MCS\"),INDEX(database1!C103:Q104,'accessori centralina'!J7,DATOS!K2),IF(DATOS!D7=\"CRA\",INDEX(database1!C120:Q120,'accessori centralina'!J7,DATOS!K2),INDEX(database1!C84:Q86,'accessori centralina'!J7,DATOS!K2)))","v":200}]
[]
[]
[]
["KMI",170]
["tubazioni",{"$f":"INDEX(B61:B70,DATOS!K19)","v":7}]
["doppio pistone",{"$f":"offerta!A133*INDEX(centraline!C134:F134,1,B9)","v":0}]
["totale",{"$f":"IF(DATOS!D28=\"KMI\",SUM(B5:B7),0)","v":0}]
["indice VB",{"$f":"MATCH('accessori centralina'!B19,centraline!B131:F131,1)","v":1}]
["codice doppio pistone",{"$f":"INDEX(centraline!C133:F133,1,B9)","v":"KIT.RAC/35KMI-TAN"}]
["L tubo KMI",{"$f":"IF(DATOS!D13=1,ODD('accessori vari'!A30*'accessori vari'!C30+'accessori vari'!A31*'accessori vari'!C31+'accessori vari'!A32*'accessori vari'!C32+'accessori vari'!A33*'accessori vari'!C33+'accessori vari'!A34*'accessori vari'!C34+'accessori vari'!A35*'accessori vari'!C35+'accessori vari'!A36*'accessori vari'!C36+'accessori vari'!A37*'accessori vari'!C37+'accessori vari'!A38*'accessori vari'!C38+'accessori vari'!A39*'accessori vari'!C39+'accessori vari'!A4*6+'accessori vari'!A5*6),1)","v":1}]
[]
["cassone","peso"]
["HL-300",50]
["HL-420",55]
["HL-420-2V",85]
["HL/OIL-265",55]
["HL/OIL-265-2V",85]
["MHL-S",22]
["XL-OIL",55]
["CM-320",125]
["CM",140]
["CA",200]
["CA/A",315]
["CG",360]
["CIF-2",160]
["CE-320/MB",80]
["CE/CM-MB",106]
["CE/CA-MB",138]
["CE/CIF-2-MB",160]
["indice",{"$f":"MATCH(DATOS!D65,A14:A30,0)","v":{"$error":"#N/A"}}]
[]
[]
["tensione linea","tensione motore"]
["230 VAC, 50 Hz mono","230 VAC, 50 Hz mono"]
["240 VAC, 50 Hz mono","240 VAC, 50 Hz mono"]
["230x3 VAC, 50 Hz","230/400 VAC, 50 Hz"]
["400x3 VAC, 50 Hz",{"$f":"IF(DATOS!D44=\"Lift\",\"400/690 VAC, 50 Hz\",\"230/400 VAC, 50 Hz\")","v":"400/690 VAC, 50 Hz"}]
["415x3 VAC, 50 Hz",{"$f":"IF(DATOS!D44=\"Lift\",\"415/720 VAC, 50 Hz\",\"240/415 VAC, 50 Hz\")","v":"415/720 VAC, 50 Hz"}]
[]
[]
["tensione speciale","extra prezzo"]
["fino a 9,5 kW",{"$f":"IF(DATOS!$D$59<=9.5,1,0)*27","v":27}]
["da 12 a 18,5 kW",{"$f":"IF(AND(DATOS!$D$59>9.5,DATOS!$D$59<=18.5),1,0)*35","v":0}]
["da 22,5 a 37 kW",{"$f":"IF(AND(DATOS!$D$59>18.5,DATOS!$D$59<=37),1,0)*70","v":0}]
["da 45 kW a 60 kW",{"$f":"IF(AND(DATOS!$D$59>37,DATOS!$D$59<75),1,0)*90","v":0}]
["75 kW",{"$f":"IF(DATOS!$D$59=75,1,0)*100","v":0}]
["extracosto",{"$f":"IF(DATOS!D46=DATOS!AF3,SUM(B43:B47)*'accessori centralina'!C16,0)","v":0}]
[]
["tensione scelta",{"$f":"INDEX(B35:B39,DATOS!K18,1)","v":"400/690 VAC, 50 Hz"}]
[]
[]
[]
[null,null,"suffisso"]
["armadio HL?",{"$f":"IF(SUM('accessori vari'!A53:A57)>0,1,0)","v":0},{"$f":"IF(AND(B55=1,LEFT(DATOS!D65,2)=\"HL\"),\"/AR\",\"\")","v":""}]
["armadio centralina CM3?",{"$f":"IF(SUM('accessori vari'!A58:A63)>0,1,0)","v":0},{"$f":"IF(AND(B56=1,DATOS!D65=\"CM-320\"),CONCATENATE(\"/A\",IF('accessori vari'!A59=1,\"R\",\"\")),\"\")","v":""}]
[]
["suffisso centralina per armadio",{"$f":"CONCATENATE(C55,C56)","v":""}]
[]
["L tubo KMI","prezzo"]
[0,0]
[1,7]
[{"$f":"A62+2","v":3},14]
[{"$f":"A63+2","v":5},{"$f":"B63+4","v":18}]
[7,{"$f":"B64+4","v":22}]
[9,26]
[11,30]
[13,34]
[15,38]
[17,42]
["indice",{"$f":"MATCH(B11,A61:A70,0)","v":2}]
[]
["tipo centralina",{"$f":"'accessori centralina'!B17","v":"MS-A/K"}]
["costo imballo cartone",{"$f":"IF(DATOS!K21=2,INDEX(centraline!B124:M124,'accessori centralina'!J21),0)","v":0}]
["costo imballo legno",{"$f":"IF(DATOS!K21=3,INDEX(centraline!B125:M125,'accessori centralina'!J21),0)","v":0}]
["costo imballo",{"$f":"B74+B75","v":0}]
[]
[]
["portata",8,24,151,381,651]
["valvola di blocco",null,{"$f":"IF('accessori centralina'!B17=\"HL\",B93,D93)","v":"1\"1/4"},{"$f":"IF(OR('accessori centralina'!B17=\"HL\",('accessori vari'!A32+'accessori vari'!A33)>0),'calcoli vari'!C93,'calcoli vari'!D93)","v":"1\"1/4"},"1\"1/2","2\""]
["portata nominale valvola","indice"]
[{"$f":"'accessori centralina'!B19*DATOS!D43/DATOS!D13","v":55},{"$f":"MATCH(A82,B79:F79,1)","v":2}]
[]
[]
["attatto valvola di blocco",{"$f":"INDEX(C80:G80,1,B82)","v":"1\"1/4"}]
["indice",{"$f":"MATCH(B85,B93:F93,0)","v":3}]
["modello valvola di blocco",{"$f":"INDEX(B94:F94,B86)","v":"1\"1/4"}]
["attacco tubo IT",{"$f":"INDEX(B95:F95,B86)","v":"1\"1/4 metrico (M45x2)"}]
["attacco tubo EN",{"$f":"INDEX(B96:F96,B86)","v":"1\"1/4 metric (M45x2)"}]
["attacco pistone IT",{"$f":"INDEX(B97:F97,B86)","v":"quadrato"}]
["attacco pistone EN",{"$f":"INDEX(B98:F98,B86)","v":"with square flange"}]
[]
["attacco valvola","3/4\"","1\"","1\"1/4","1\"1/2","2\""]
["modello valvola","3/4\"","1\"1/4","1\"1/4","1\"1/2","2\""]
["connessione tubo IT","3/4\" metrico (M30x2)","1\" metrico (M36x2)","1\"1/4 metrico (M45x2)","1\"1/2 metrico (M52x2)","G 2\" BSP"]
["connessione tubo EN","3/4\" metric (M30x2)","1\" metric (M36x2)","1\"1/4 metric (M45x2)","1\"1/2 metric (M52x2)","G 2\" BSP"]
["attacco pistone IT","quadrato","quadrato","quadrato","quadrato","rotondo 2\""]
["attacco pistone EN","with square flange","with square flange","with square flange","with square flange","cylindrical 2\""]
[]
[]
["Door Lock Valve"]
["portata pompa",{"$f":"DATOS!D45","v":55}]
["pressione statica minima",{"$f":"DATOS!D40","v":23.39178238215667}]
["la pressione è corretta?",{"$f":"IF(OR(AND(B105=150,B103>=13),AND(B105=440,B103>=17)),1,0)","v":1}]
["150 o 440?",{"$f":"IF(B102<=150,150,440)","v":150}]
["centralina elettronica",{"$f":"IF(DATOS!D51=\"ELE\",1,0)","v":0}]
["CIF-2",{"$f":"IF(DATOS!D50=\"CIF\",1,0)","v":0}]
["> 250 l/min",{"$f":"IF(B102>250,1,0)","v":0}]
["> 440 l/min",{"$f":"IF(B102>440,1,0)","v":0}]
["M o B",{"$f":"IF(DATOS!K23=1,\"B\",\"M\")","v":"B"}]
["macro-tipo",{"$f":"IF((B106+B107+B108)>0,\"HSV\",\"HM-SV\")","v":"HM-SV"}]
["dicitura completa",{"$f":"IF(B109>0,\"ERRORE\",CONCATENATE(B111,\" \",B105,\" \",B110))","v":"HM-SV 150 B"}]
["costo",{"$f":"IF(DATOS!K16=3,150,0)","v":0}]
["tipo","codice"]
["HM-SV 150 M","Z000008AA-A0"]
["HM-SV 150 B","Z000009AA-A0"]
["HM-SV 440 M","Z000010AA-A0"]
["HM-SV 440 B","Z000011AA-A0"]
["HSV 150 M",8690503]
["HSV 150 B",8690505]
["HSV 440 M",8690504]
["HSV 440 B",8690506]
["indice",{"$f":"MATCH(B112,A115:A122,0)","v":2}]
["codice",{"$f":"INDEX(B115:B122,B123)","v":"Z000009AA-A0"}]

{"sheet":"centraline","index":8,"n_rows":679,"n_cols":25,"rows_kept":679,"cut":false,"hidden":false,"merged":[[644,1,644,2],[228,3,229,3],[243,3,244,3],[258,3,259,3],[271,3,272,3],[285,3,286,3],[304,3,305,3],[332,3,333,3],[520,3,521,3],[535,3,536,3],[535,1,535,2],[228,1,228,2],[243,1,243,2],[258,1,258,2],[271,1,271,2],[285,1,285,2],[547,3,548,3],[362,3,363,3],[397,3,398,3],[447,3,448,3],[483,3,484,3],[582,0,583,0],[582,1,582,2],[614,0,615,0],[614,1,614,2],[332,1,332,2],[362,1,362,2],[397,1,397,2],[447,1,447,2],[483,1,483,2],[520,1,520,2],[547,0,548,0],[547,1,547,2],[304,1,304,2],[201,1,201,2],[202,1,202,2],[201,3,202,3],[214,1,214,2],[215,1,215,2],[214,3,215,3],[171,1,171,2],[172,1,172,2],[171,3,172,3],[186,1,186,2],[187,1,187,2],[186,3,187,3]]}
[null,null,null,null,null,null,null,null,null,null,null,"potencia"]
["portata",0.75,1.1000000000000001,1.5,1.8,2,2.2000000000000002,2.5,3,3.3,3.7,4.5,4.8,6,7.5,9.5,12,15,18.5,22.5,30,37,45,60,75]
["55CM","x","x","x","x","x","x","x","x","x","x",{"$f":"D335","v":1597},"x",{"$f":"D336","v":1617},"x","x","x","x","x","x","x","x","x","x","x"]
["75CM","x","x","x","x","x","x","x","x","x","x",{"$f":"D337","v":1597},"x",{"$f":"D338","v":1617},{"$f":"D339","v":1653},"x","x","x","x","x","x","x","x","x","x"]
["100CM","x","x","x","x","x","x","x","x","x","x",{"$f":"D340","v":1601},"x",{"$f":"D341","v":1637},{"$f":"D342","v":1653},{"$f":"D343","v":1680},"x","x","x","x","x","x","x","x","x"]
["125CM","x","x","x","x","x","x","x","x","x","x","x","x",{"$f":"D344","v":1637},{"$f":"D345","v":1653},{"$f":"D346","v":1680},{"$f":"D347","v":1722},"x","x","x","x","x","x","x","x"]
["150CM","x","x","x","x","x","x","x","x","x","x","x","x",{"$f":"D348","v":1637},{"$f":"D349","v":1653},{"$f":"D350","v":1680},{"$f":"D351","v":1722},{"$f":"D352","v":1749},"x","x","x","x","x","x","x"]
["180CM","x","x","x","x","x","x","x","x","x","x","x","x","x","x",{"$f":"D353","v":1972},{"$f":"D354","v":2017},{"$f":"D355","v":2047},{"$f":"D356","v":2081},"x","x","x","x","x","x"]
["210CM","x","x","x","x","x","x","x","x","x","x","x","x","x","x",{"$f":"D357","v":1972},{"$f":"D358","v":2017},{"$f":"D359","v":2047},{"$f":"D360","v":2081},"x","x","x","x","x","x"]
["55CE/CM-MB","x","x","x","x","x","x","x","x","x","x",{"$f":"D585","v":2461},"x",{"$f":"D586","v":2479},"x","x","x","x","x","x","x","x","x","x","x"]
["75CE/CM-MB","x","x","x","x","x","x","x","x","x","x",{"$f":"D587","v":2461},"x",{"$f":"D588","v":2479},{"$f":"D589","v":2539},"x","x","x","x","x","x","x","x","x","x"]
["100CE/CM-MB","x","x","x","x","x","x","x","x","x","x",{"$f":"D590","v":2527},"x",{"$f":"D591","v":2563},{"$f":"D592","v":2579},{"$f":"D593","v":2606},"x","x","x","x","x","x","x","x","x"]
["125CE/CM-MB","x","x","x","x","x","x","x","x","x","x","x","x",{"$f":"D595","v":2563},{"$f":"D596","v":2579},{"$f":"D597","v":2606},{"$f":"D598","v":2648},"x","x","x","x","x","x","x","x"]
["150CE/CM-MB","x","x","x","x","x","x","x","x","x","x","x","x",{"$f":"D600","v":2563},{"$f":"D601","v":2579},{"$f":"D602","v":2606},{"$f":"D603","v":2648},{"$f":"D604","v":2675},"x","x","x","x","x","x","x"]
["180CE/CM-MB","x","x","x","x","x","x","x","x","x","x","x","x","x","x",{"$f":"D605","v":2904},{"$f":"D606","v":2948},{"$f":"D607","v":2977},{"$f":"D608","v":3012},"x","x","x","x","x","x"]
["210CE/CM-MB","x","x","x","x","x","x","x","x","x","x","x","x","x","x",{"$f":"D609","v":2904},{"$f":"D610","v":2948},{"$f":"D611","v":2977},{"$f":"D612","v":3012},"x","x","x","x","x","x"]
["15CM-320M","x","x",{"$f":"D288","v":1602},"x","x",{"$f":"D289","v":1632},"x","x","x","x","x","x","x","x","x","x","x","x","x","x","x","x","x","x"]
["23CM-320M","x","x",{"$f":"D290","v":1602},"x","x",{"$f":"D291","v":1670},"x",{"$f":"D292","v":1712},"x","x","x","x","x","x","x","x","x","x","x","x","x","x","x","x"]
["30CM-320M","x","x","x","x","x",{"$f":"D292","v":1712},"x",{"$f":"D293","v":1730},"x",{"$f":"D294","v":1772},"x","x","x","x","x","x","x","x","x","x","x","x","x","x"]
["35CM-320M","x","x","x","x","x",{"$f":"D293","v":1730},"x",{"$f":"D294","v":1772},"x",{"$f":"D295","v":1807},"x","x","x","x","x","x","x","x","x","x","x","x","x","x"]
["55CM-320M","x","x","x","x","x","x","x",{"$f":"D296","v":1772},"x",{"$f":"D297","v":1807},"x",{"$f":"D298","v":1890},{"$f":"D299","v":2002},"x","x","x","x","x","x","x","x","x","x","x"]
["75CM-320M","x","x","x","x","x","x","x","x","x",{"$f":"D300","v":1807},"x",{"$f":"D301","v":1890},{"$f":"D302","v":2002},"x","x","x","x","x","x","x","x","x","x","x"]
["15CM-320","x","x","x","x",{"$f":"D307","v":1512},"x","x","x","x","x","x","x","x","x","x","x","x","x","x","x","x","x","x","x"]
["23CM-320","x","x","x","x",{"$f":"D308","v":1512},"x","x",{"$f":"D309","v":1529},"x","x","x","x","x","x","x","x","x","x","x","x","x","x","x","x"]
["30CM-320","x","x","x","x",{"$f":"D309","v":1529},"x","x",{"$f":"D310","v":1523},"x","x",{"$f":"D311","v":1529},"x","x","x","x","x","x","x","x","x","x","x","x","x"]
["35CM-320","x","x","x","x",{"$f":"D310","v":1523},"x","x",{"$f":"D311","v":1529},"x","x",{"$f":"D312","v":1535},"x","x","x","x","x","x","x","x","x","x","x","x","x"]
["55CM-320","x","x","x","x","x","x","x","x","x","x",{"$f":"D313","v":1535},"x",{"$f":"D314","v":1553},"x","x","x","x","x","x","x","x","x","x","x"]
["75CM-320","x","x","x","x","x","x","x","x","x","x",{"$f":"D315","v":1535},"x",{"$f":"D316","v":1553},{"$f":"D317","v":1613},"x","x","x","x","x","x","x","x","x","x"]
["100CM-320","x","x","x","x","x","x","x","x","x","x",{"$f":"D318","v":1601},"x",{"$f":"D319","v":1637},{"$f":"D320","v":1653},{"$f":"D321","v":1680},"x","x","x","x","x","x","x","x","x"]
["125CM-320","x","x","x","x","x","x","x","x","x","x","x","x",{"$f":"D322","v":1637},{"$f":"D323","v":1653},{"$f":"D324","v":1680},{"$f":"D325","v":1722},"x","x","x","x","x","x","x","x"]
["150CM-320","x","x","x","x","x","x","x","x","x","x","x","x",{"$f":"D326","v":1637},{"$f":"D327","v":1653},{"$f":"D328","v":1680},{"$f":"D329","v":1722},{"$f":"D330","v":1749},"x","x","x","x","x","x","x"]
["15CE-320/MB","x","x","x","x",{"$f":"D550","v":2438},"x","x",{"$f":"D551","v":2454},"x","x","x","x","x","x","x","x","x","x","x","x","x","x","x","x"]
["23CE-320/MB","x","x","x","x",{"$f":"D552","v":2438},"x","x",{"$f":"D553","v":2454},"x","x",{"$f":"D554","v":2461},"x","x","x","x","x","x","x","x","x","x","x","x","x"]
["35CE-320/MB","x","x","x","x",{"$f":"D555","v":2449},"x","x",{"$f":"D556","v":2454},"x","x",{"$f":"D557","v":2461},"x","x","x","x","x","x","x","x","x","x","x","x","x"]
["55CE-320/MB","x","x","x","x","x","x","x",{"$f":"D558","v":2454},"x","x",{"$f":"D559","v":2461},"x",{"$f":"D560","v":2479},"x","x","x","x","x","x","x","x","x","x","x"]
["75CE-320/MB","x","x","x","x","x","x","x",{"$f":"D561","v":2454},"x","x",{"$f":"D562","v":2461},"x",{"$f":"D563","v":2479},{"$f":"D564","v":2539},"x","x","x","x","x","x","x","x","x","x"]
["100CE-320/MB","x","x","x","x","x","x","x","x","x","x",{"$f":"D565","v":2527},"x",{"$f":"D566","v":2563},{"$f":"D567","v":2579},{"$f":"D568","v":2606},{"$f":"D569","v":2648},"x","x","x","x","x","x","x","x"]
["125CE-320/MB","x","x","x","x","x","x","x","x","x","x",{"$f":"D570","v":2527},"x",{"$f":"D571","v":2563},{"$f":"D572","v":2579},{"$f":"D573","v":2606},{"$f":"D574","v":2648},"x","x","x","x","x","x","x","x"]
["150CE-320/MB","x","x","x","x","x","x","x","x","x","x","x","x",{"$f":"D576","v":2563},{"$f":"D577","v":2579},{"$f":"D578","v":2606},{"$f":"D579","v":2648},{"$f":"D580","v":2675},"x","x","x","x","x","x","x"]
["55CA","x","x","x","x","x","x","x","x","x","x",{"$f":"D365","v":1714},"x",{"$f":"D366","v":1734},"x","x","x","x","x","x","x","x","x","x","x"]
["75CA","x","x","x","x","x","x","x","x","x","x",{"$f":"D367","v":1714},"x",{"$f":"D368","v":1734},{"$f":"D369","v":1770},"x","x","x","x","x","x","x","x","x","x"]
["100CA","x","x","x","x","x","x","x","x","x","x",{"$f":"D370","v":1718},"x",{"$f":"D371","v":1754},{"$f":"D372","v":1770},{"$f":"D373","v":1797},"x","x","x","x","x","x","x","x","x"]
["125CA","x","x","x","x","x","x","x","x","x","x","x","x",{"$f":"D374","v":1754},{"$f":"D375","v":1770},{"$f":"D376","v":1797},{"$f":"D377","v":1839},"x","x","x","x","x","x","x","x"]
["150CA","x","x","x","x","x","x","x","x","x","x","x","x",{"$f":"D378","v":1754},{"$f":"D379","v":1770},{"$f":"D380","v":1797},{"$f":"D381","v":1839},{"$f":"D382","v":1866},"x","x","x","x","x","x","x"]
["180CA","x","x","x","x","x","x","x","x","x","x","x","x","x","x",{"$f":"D383","v":1978},{"$f":"D384","v":2022},{"$f":"D385","v":2051},{"$f":"D386","v":2086},"x","x","x","x","x","x"]
["210CA","x","x","x","x","x","x","x","x","x","x","x","x","x","x",{"$f":"D387","v":1978},{"$f":"D388","v":2022},{"$f":"D389","v":2051},{"$f":"D390","v":2086},{"$f":"D391","v":2176},"x","x","x","x","x"]
["250CA","x","x","x","x","x","x","x","x","x","x","x","x","x","x","x","x",{"$f":"D392","v":2134},{"$f":"D393","v":2171},{"$f":"D394","v":2275},{"$f":"D395","v":2389},"x","x","x","x"]
["180CE/CA-MB","x","x","x","x","x","x","x","x","x","x","x","x","x","x",{"$f":"D617","v":2904},{"$f":"D618","v":2948},{"$f":"D619","v":2977},{"$f":"D620","v":3012},"x","x","x","x","x","x"]
["210CE/CA-MB","x","x","x","x","x","x","x","x","x","x","x","x","x","x",{"$f":"D621","v":2904},{"$f":"D622","v":2948},{"$f":"D623","v":2977},{"$f":"D624","v":3012},{"$f":"D625","v":3102},"x","x","x","x","x"]
["250CE/CA-MB","x","x","x","x","x","x","x","x","x","x","x","x","x","x","x","x",{"$f":"D626","v":3060},{"$f":"D627","v":3097},{"$f":"D628","v":3201},{"$f":"D629","v":3315},"x","x","x","x"]
["300CE/CA-MB","x","x","x","x","x","x","x","x","x","x","x","x","x","x","x",{"$f":"D630","v":3586},{"$f":"D631","v":3617},{"$f":"D632","v":3653},{"$f":"D633","v":3701},{"$f":"D634","v":3859},"x","x","x","x"]
["330CE/CA-MB","x","x","x","x","x","x","x","x","x","x","x","x","x","x","x","x",{"$f":"D635","v":3640},{"$f":"D636","v":3668},{"$f":"D637","v":3710},{"$f":"D638","v":3907},"x","x","x","x"]
["380CE/CA-MB","x","x","x","x","x","x","x","x","x","x","x","x","x","x","x","x",{"$f":"D639","v":3701},{"$f":"D640","v":3701},{"$f":"D641","v":3718},{"$f":"D642","v":3957},"x","x","x","x"]
["55CA/A","x","x","x","x","x","x","x","x","x","x",{"$f":"D400","v":1860},"x",{"$f":"D401","v":1880},"x","x","x","x","x","x","x","x","x","x","x"]
["75CA/A","x","x","x","x","x","x","x","x","x","x",{"$f":"D402","v":1860},"x",{"$f":"D403","v":1880},{"$f":"D404","v":1916},"x","x","x","x","x","x","x","x","x","x"]
["100CA/A","x","x","x","x","x","x","x","x","x","x",{"$f":"D405","v":1864},"x",{"$f":"D406","v":1900},{"$f":"D407","v":1916},{"$f":"D408","v":1943},"x","x","x","x","x","x","x","x","x"]
["125CA/A","x","x","x","x","x","x","x","x","x","x","x","x",{"$f":"D409","v":1900},{"$f":"D410","v":1916},{"$f":"D411","v":1943},{"$f":"D412","v":1985},"x","x","x","x","x","x","x","x"]
["150CA/A","x","x","x","x","x","x","x","x","x","x","x","x",{"$f":"D413","v":1900},{"$f":"D414","v":1916},{"$f":"D415","v":1943},{"$f":"D416","v":1985},{"$f":"D417","v":2012},"x","x","x","x","x","x","x"]
["180CA/A","x","x","x","x","x","x","x","x","x","x","x","x","x","x",{"$f":"D418","v":2124},{"$f":"D419","v":2168},{"$f":"D420","v":2197},{"$f":"D421","v":2232},"x","x","x","x","x","x"]
["210CA/A","x","x","x","x","x","x","x","x","x","x","x","x","x","x",{"$f":"D422","v":2124},{"$f":"D423","v":2168},{"$f":"D424","v":2197},{"$f":"D425","v":2232},{"$f":"D426","v":2322},"x","x","x","x","x"]
["250CA/A","x","x","x","x","x","x","x","x","x","x","x","x","x","x","x","x",{"$f":"D427","v":2280},{"$f":"D428","v":2317},{"$f":"D429","v":2421},{"$f":"D430","v":2535},"x","x","x","x"]
["300CA/A","x","x","x","x","x","x","x","x","x","x","x","x","x","x","x",{"$f":"D431","v":2310},{"$f":"D432","v":2341},{"$f":"D433","v":2377},{"$f":"D434","v":2425},{"$f":"D435","v":2583},"x","x","x","x"]
["330CA/A","x","x","x","x","x","x","x","x","x","x","x","x","x","x","x","x",{"$f":"D436","v":2364},{"$f":"D437","v":2392},{"$f":"D438","v":2434},{"$f":"D439","v":2631},{"$f":"D440","v":2766},"x","x","x"]
["380CA/A","x","x","x","x","x","x","x","x","x","x","x","x","x","x","x","x",{"$f":"D441","v":2425},{"$f":"D442","v":2425},{"$f":"D443","v":2442},{"$f":"D444","v":2681},{"$f":"D445","v":2789},"x","x","x"]
["300CG","x","x","x","x","x","x","x","x","x","x","x","x","x","x","x",{"$f":"D450","v":2542},{"$f":"D451","v":2573},{"$f":"D452","v":2609},{"$f":"D453","v":2657},{"$f":"D454","v":2815},"x","x","x","x"]
["330CG","x","x","x","x","x","x","x","x","x","x","x","x","x","x","x","x",{"$f":"D455","v":2596},{"$f":"D456","v":2624},{"$f":"D457","v":2666},{"$f":"D458","v":2863},{"$f":"D459","v":2998},"x","x","x"]
["380CG","x","x","x","x","x","x","x","x","x","x","x","x","x","x","x","x",{"$f":"D460","v":2657},{"$f":"D461","v":2657},{"$f":"D462","v":2674},{"$f":"D463","v":2913},{"$f":"D464","v":3021},"x","x","x"]
["440CG","x","x","x","x","x","x","x","x","x","x","x","x","x","x","x","x","x",{"$f":"D465","v":2879},{"$f":"D466","v":3007},{"$f":"D467","v":3137},{"$f":"D468","v":3266},{"$f":"D469","v":3280},"x","x"]
["500CG","x","x","x","x","x","x","x","x","x","x","x","x","x","x","x","x","x",{"$f":"D470","v":2879},{"$f":"D471","v":3007},{"$f":"D472","v":3137},{"$f":"D473","v":3266},{"$f":"D474","v":3280},{"$f":"D475","v":3300},"x"]
["650CG","x","x","x","x","x","x","x","x","x","x","x","x","x","x","x","x","x","x",{"$f":"D476","v":3137},{"$f":"D477","v":3266},{"$f":"D478","v":3390},{"$f":"D479","v":3403},{"$f":"D480","v":3446},{"$f":"D481","v":3494}]
["35CIF-2","x","x","x","x",{"$f":"D486","v":2121},"x","x",{"$f":"D487","v":2126},"x","x",{"$f":"D488","v":2132},"x","x","x","x","x","x","x","x","x","x","x","x","x"]
["55CIF-2","x","x","x","x","x","x","x","x","x","x",{"$f":"D489","v":2132},"x",{"$f":"D490","v":2153},"x","x","x","x","x","x","x","x","x","x","x"]
["75CIF-2","x","x","x","x","x","x","x","x","x","x",{"$f":"D491","v":2132},"x",{"$f":"D492","v":2153},{"$f":"D493","v":2189},"x","x","x","x","x","x","x","x","x","x"]
["100CIF-2","x","x","x","x","x","x","x","x","x","x",{"$f":"D494","v":2136},"x",{"$f":"D495","v":2172},{"$f":"D496","v":2189},{"$f":"D497","v":2216},"x","x","x","x","x","x","x","x","x"]
["125CIF-2","x","x","x","x","x","x","x","x","x","x","x","x",{"$f":"D498","v":2172},{"$f":"D499","v":2189},{"$f":"D500","v":2216},{"$f":"D501","v":2258},"x","x","x","x","x","x","x","x"]
["150CIF-2","x","x","x","x","x","x","x","x","x","x","x","x",{"$f":"D502","v":2172},{"$f":"D503","v":2189},{"$f":"D504","v":2216},{"$f":"D505","v":2258},{"$f":"D506","v":2285},"x","x","x","x","x","x","x"]
["180CIF-2","x","x","x","x","x","x","x","x","x","x","x","x","x","x",{"$f":"D507","v":2508},{"$f":"D508","v":2552},{"$f":"D509","v":2582},{"$f":"D510","v":2616},"x","x","x","x","x","x"]
["210CIF-2","x","x","x","x","x","x","x","x","x","x","x","x","x","x",{"$f":"D511","v":2508},{"$f":"D512","v":2552},{"$f":"D513","v":2582},{"$f":"D514","v":2616},{"$f":"D515","v":2707},"x","x","x","x","x"]
["250CIF-2","x","x","x","x","x","x","x","x","x","x","x","x","x","x","x","x",{"$f":"D516","v":2665},{"$f":"D517","v":2702},{"$f":"D518","v":2806},"x","x","x","x","x"]
["35CE/CIF-2-MB","x","x","x","x",{"$f":"D647","v":3047},"x","x",{"$f":"D648","v":3052},"x","x",{"$f":"D649","v":3058},"x","x","x","x","x","x","x","x","x","x","x","x","x"]
["55CE/CIF-2-MB","x","x","x","x","x","x","x","x","x","x",{"$f":"D650","v":3058},"x",{"$f":"D651","v":3079},"x","x","x","x","x","x","x","x","x","x","x"]
["75CE/CIF-2-MB","x","x","x","x","x","x","x","x","x","x",{"$f":"D652","v":3058},"x",{"$f":"D653","v":3079},{"$f":"D654","v":3115},"x","x","x","x","x","x","x","x","x","x"]
["100CE/CIF-2-MB","x","x","x","x","x","x","x","x","x","x",{"$f":"D655","v":3062},"x",{"$f":"D656","v":3098},{"$f":"D657","v":3115},{"$f":"D658","v":3142},"x","x","x","x","x","x","x","x","x"]
["125CE/CIF-2-MB","x","x","x","x","x","x","x","x","x","x","x","x",{"$f":"D659","v":3098},{"$f":"D660","v":3115},{"$f":"D661","v":3142},{"$f":"D662","v":3184},"x","x","x","x","x","x","x","x"]
["150CE/CIF-2-MB","x","x","x","x","x","x","x","x","x","x","x","x",{"$f":"D663","v":3098},{"$f":"D664","v":3115},{"$f":"D665","v":3142},{"$f":"D666","v":3184},{"$f":"D667","v":3211},"x","x","x","x","x","x","x"]
["180CE/CIF-2-MB","x","x","x","x","x","x","x","x","x","x","x","x","x","x",{"$f":"D668","v":3434},{"$f":"D669","v":3478},{"$f":"D670","v":3508},{"$f":"D671","v":3542},"x","x","x","x","x","x"]
["210CE/CIF-2-MB","x","x","x","x","x","x","x","x","x","x","x","x","x","x",{"$f":"D672","v":3434},{"$f":"D673","v":3478},{"$f":"D674","v":3508},{"$f":"D675","v":3542},{"$f":"D676","v":3633},"x","x","x","x","x"]
["250CE/CIF-2-MB","x","x","x","x","x","x","x","x","x","x","x","x","x","x","x","x",{"$f":"D677","v":3591},{"$f":"D678","v":3628},{"$f":"D679","v":3732},"x","x","x","x","x"]
["8HLM",{"$f":"D174","v":976},{"$f":"D175","v":991},"x","x","x","x","x","x","x","x","x","x","x","x","x","x","x","x","x","x","x","x","x","x"]
["12HLM",{"$f":"D176","v":976},{"$f":"D177","v":991},{"$f":"D178","v":1000},"x","x","x","x","x","x","x","x","x","x","x","x","x","x","x","x","x","x","x","x","x"]
["18HLM","x",{"$f":"D179","v":991},{"$f":"D180","v":1000},{"$f":"D181","v":1016},"x","x","x","x","x","x","x","x","x","x","x","x","x","x","x","x","x","x","x","x"]
["23HLM","x","x",{"$f":"D182","v":1000},{"$f":"D183","v":1016},"x",{"$f":"D184","v":1110},"x","x","x","x","x","x","x","x","x","x","x","x","x","x","x","x","x","x"]
["8HL",{"$f":"D231","v":926},{"$f":"D232","v":936},"x","x","x","x","x","x","x","x","x","x","x","x","x","x","x","x","x","x","x","x","x","x"]
["12HL",{"$f":"D233","v":926},{"$f":"D234","v":936},{"$f":"D235","v":950},"x","x","x","x","x","x","x","x","x","x","x","x","x","x","x","x","x","x","x","x","x"]
["18HL",{"$f":"D236","v":926},{"$f":"D237","v":936},{"$f":"D238","v":950},"x","x","x","x","x","x","x","x","x","x","x","x","x","x","x","x","x","x","x","x","x"]
["23HL","x",{"$f":"D239","v":936},{"$f":"D240","v":950},"x","x",{"$f":"D241","v":969},"x","x","x","x","x","x","x","x","x","x","x","x","x","x","x","x","x","x"]
["18HLMD","x",{"$f":"D204","v":1206},{"$f":"D205","v":1215},{"$f":"D206","v":1231},"x","x","x","x","x","x","x","x","x","x","x","x","x","x","x","x","x","x","x","x"]
["23HLMD","x","x",{"$f":"D207","v":1215},{"$f":"D208","v":1231},"x",{"$f":"D209","v":1326},"x",{"$f":"D210","v":1483},"x","x","x","x","x","x","x","x","x","x","x","x","x","x","x","x"]
["30HLMD","x","x","x",{"$f":"D211","v":1366},"x",{"$f":"D212","v":1382},"x",{"$f":"D213","v":1541},"x","x","x","x","x","x","x","x","x","x","x","x","x","x","x","x"]
["18HLD",{"$f":"D261","v":1141},{"$f":"D262","v":1152},{"$f":"D263","v":1165},"x","x","x","x","x","x","x","x","x","x","x","x","x","x","x","x","x","x","x","x","x"]
["23HLD","x",{"$f":"D264","v":1152},{"$f":"D265","v":1165},"x","x",{"$f":"D266","v":1185},"x","x","x","x","x","x","x","x","x","x","x","x","x","x","x","x","x","x"]
["30HLD","x","x",{"$f":"D267","v":1302},"x","x",{"$f":"D268","v":1315},"x",{"$f":"D269","v":1400},"x","x","x","x","x","x","x","x","x","x","x","x","x","x","x","x"]
["8HLM-OIL",{"$f":"D189","v":1164},{"$f":"D190","v":1178},"x","x","x","x","x","x","x","x","x","x","x","x","x","x","x","x","x","x","x","x","x","x"]
["12HLM-OIL",{"$f":"D191","v":1164},{"$f":"D192","v":1178},{"$f":"D193","v":1188},"x","x","x","x","x","x","x","x","x","x","x","x","x","x","x","x","x","x","x","x","x"]
["18HLM-OIL","x",{"$f":"D194","v":1178},{"$f":"D195","v":1188},{"$f":"D196","v":1203},"x","x","x","x","x","x","x","x","x","x","x","x","x","x","x","x","x","x","x","x"]
["23HLM-OIL","x","x",{"$f":"D197","v":1188},{"$f":"D198","v":1203},"x",{"$f":"D199","v":1298},"x","x","x","x","x","x","x","x","x","x","x","x","x","x","x","x","x","x"]
["8HL-OIL",{"$f":"D246","v":1113},{"$f":"D247","v":1124},"x","x","x","x","x","x","x","x","x","x","x","x","x","x","x","x","x","x","x","x","x","x"]
["12HL-OIL",{"$f":"D248","v":1113},{"$f":"D249","v":1124},{"$f":"D250","v":1137},"x","x","x","x","x","x","x","x","x","x","x","x","x","x","x","x","x","x","x","x","x"]
["18HL-OIL",{"$f":"D251","v":1113},{"$f":"D252","v":1124},{"$f":"D253","v":1137},"x","x","x","x","x","x","x","x","x","x","x","x","x","x","x","x","x","x","x","x","x"]
["23HL-OIL","x",{"$f":"D254","v":1124},{"$f":"D255","v":1137},"x","x",{"$f":"D256","v":1157},"x","x","x","x","x","x","x","x","x","x","x","x","x","x","x","x","x","x"]
["18HLMD-OIL","x",{"$f":"D217","v":1419},{"$f":"D218","v":1429},{"$f":"D219","v":1444},"x","x","x","x","x","x","x","x","x","x","x","x","x","x","x","x","x","x","x","x"]
["23HLMD-OIL","x","x",{"$f":"D220","v":1429},{"$f":"D221","v":1444},"x",{"$f":"D222","v":1539},"x",{"$f":"D223","v":1696},"x","x","x","x","x","x","x","x","x","x","x","x","x","x","x","x"]
["30HLMD-OIL","x","x","x",{"$f":"D224","v":1579},"x",{"$f":"D225","v":1595},"x",{"$f":"D226","v":1754},"x","x","x","x","x","x","x","x","x","x","x","x","x","x","x","x"]
["18HLD-OIL",{"$f":"D274","v":1354},{"$f":"D275","v":1365},{"$f":"D276","v":1378},"x","x","x","x","x","x","x","x","x","x","x","x","x","x","x","x","x","x","x","x","x"]
["23HLD-OIL","x",{"$f":"D277","v":1365},{"$f":"D278","v":1378},"x","x",{"$f":"D279","v":1398},"x","x","x","x","x","x","x","x","x","x","x","x","x","x","x","x","x","x"]
["30HLD-OIL","x","x",{"$f":"D280","v":1491},"x","x",{"$f":"D281","v":1502},"x",{"$f":"D282","v":1508},"x","x","x","x","x","x","x","x","x","x","x","x","x","x","x","x"]
[null,0.75,1.1000000000000001,1.5,1.8,2,2.2000000000000002,2.5,3,3.3,3.7,4.5,4.8,6,7.5,9.5,12,15,18.5,22.5,30,37,45,60,75]
[]
[]
[]
[null,null,"CM-320","CM","CA","CA/A","CG","HL","CE-320/MB","CE/CM-MB","CE/CA-MB","CIF-2","CE/CIF-2-MB"]
["cassone maggiorato",null,0,117,146,231,0,0,0,117,146,0,0]
["stella triangolo",null,35,35,35,35,47,0,0,0,0,35,0]
["imballo cartone",null,43,49,60,80,106,36,43,49,60,"x","x"]
["imballo legno",null,147,147,"x","x","x","x",121,147,"x","x","x"]
[]
[]
["lamiera interna",null,0,14.5,14.5,14.5,21,0,0,0]
["Rupture valve",null,"1\"1/4","1\"1/4","1\"1/2","1\"1/2","2\"","3/4\"","1\"1/4","1\"1/2"]
[]
["portata",15,151,381,651,"HL"]
["Rupture valve",null,"1\"1/4","1\"1/2","2\"","3/4\""]
["KMI doppio pistone",null,"KIT.RAC/35KMI-TAN","KIT.RAC/42KMI-TAN","KIT.RAC/2\"KMI-TAN"]
["netto",null,120,130,130]
[]
[]
[null,"HP","KW"]
[null,1,0.75,null,"PARA P",{"$f":"MATCH('accessori centralina'!B18,C138:C161,0)","v":13}]
[null,1.5,1.1000000000000001,null,"kW prezzo",{"$f":"'accessori centralina'!B18","v":6}]
[null,2,1.5,null,"kw",{"$f":"DATOS!D59","v":6}]
[null,2.5,1.8,null,"hp",{"$f":"INDEX(B138:B161,F138,1)","v":8}]
[null,2.7,2]
[null,3,2.2000000000000002]
[null,3.5,2.5]
[null,4,3]
[null,4.5,3.3]
[null,5,3.7]
[null,6,4.5]
[null,6.5,4.8]
[null,8,6]
[null,10,7.5]
[null,13,9.5]
[null,16,12]
[null,20,15]
[null,25,18.5]
[null,30,22.5]
[null,40,30]
[null,50,37]
[null,60,45]
[null,80,60]
[null,100,75]
[]
[]
[]
[]
[]
[]
[]
[]
["LISTINO CENTRALINE"]
[]
["CENTRALINA TIPO","MOTORI IN ARIA",null,"PREZZO €"]
["HL-300, HL-420\nMonofase","KW                           HP"]
["8 l/m",0.75,1,976]
["8 l/m",1.1000000000000001,1.5,991]
["12 l/m",0.75,1,976]
["12 l/m",1.1000000000000001,1.5,991]
["12 l/m",1.5,2,1000]
["18 l/m",1.1000000000000001,1.5,991]
["18 l/m",1.5,2,1000]
["18 l/m",1.8,2.5,1016]
["23 l/m",1.5,2,1000]
["23 l/m",1.8,2.5,1016]
["23 l/m",2.2000000000000002,3,1110]
[]
[]
["CENTRALINA TIPO","MOTORI IN OLIO",null,"PREZZO €"]
["HL/OIL-265\nMonofase","KW                           HP"]
["8 l/m",0.75,1,1164]
["8 l/m",1.1000000000000001,1.5,1178]
["12 l/m",0.75,1,1164]
["12 l/m",1.1000000000000001,1.5,1178]
["12 l/m",1.5,2,1188]
["18 l/m",1.1000000000000001,1.5,1178]
["18 l/m",1.5,2,1188]
["18 l/m",1.8,2.5,1203]
["23 l/m",1.5,2,1188]
["23 l/m",1.8,2.5,1203]
["23 l/m",2.2000000000000002,3,1298]
[]
[]
["CENTRALINA TIPO","MOTORI IN ARIA",null,"PREZZO €"]
["HL-420-2V\nMonofase","KW                           HP"]
["18 l/m",1.1000000000000001,1.5,1206]
["18 l/m",1.5,2,1215]
["18 l/m",1.8,2.5,1231]
["23 l/m",1.5,2,1215]
["23 l/m",1.8,2.5,1231]
["23 l/m",2.2000000000000002,3,1326]
["23 l/m",3,4,1483]
["30 l/m",1.8,2.5,1366]
["30 l/m",2.2000000000000002,3,1382]
["30 l/m",3,4,1541]
[]
["CENTRALINA TIPO","MOTORI IN OLIO",null,"PREZZO"]
["HL/OIL-265-2V\nMonofase","KW                           HP"]
["18 l/m",1.1000000000000001,1.5,1419]
["18 l/m",1.5,2,1429]
["18 l/m",1.8,2.5,1444]
["23 l/m",1.5,2,1429]
["23 l/m",1.8,2.5,1444]
["23 l/m",2.2000000000000002,3,1539]
["23 l/m",3,4,1696]
["30 l/m",1.8,2.5,1579]
["30 l/m",2.2000000000000002,3,1595]
["30 l/m",3,4,1754]
[]
[]
["HL-300, HL-420","MOTORI IN ARIA",null,"PREZZO"]
["trifase","KW","HP"]
["8 l/m",0.75,1,926]
["8 l/m",1.1000000000000001,1.5,936]
["12 l/m",0.75,1,926]
["12 l/m",1.1000000000000001,1.5,936]
["12 l/m",1.5,2,950]
["18 l/m",0.75,1,926]
["18 l/m",1.1000000000000001,1.5,936]
["18 l/m",1.5,2,950]
["23 l/m",1.1000000000000001,1.5,936]
["23 l/m",1.5,2,950]
["23 l/m",2.2000000000000002,3,969]
[]
[]
["HL/OIL-265","MOTORI IN OLIO",null,"PREZZO"]
["trifase","KW","HP"]
["8 l/m",0.75,1,1113]
["8 l/m",1.1000000000000001,1.5,1124]
["12 l/m",0.75,1,1113]
["12 l/m",1.1000000000000001,1.5,1124]
["12 l/m",1.5,2,1137]
["18 l/m",0.75,1,1113]
["18 l/m",1.1000000000000001,1.5,1124]
["18 l/m",1.5,2,1137]
["23 l/m",1.1000000000000001,1.5,1124]
["23 l/m",1.5,2,1137]
["23 l/m",2.2000000000000002,3,1157]
[]
[]
["HL-420-2V","MOTORI IN ARIA",null,"PREZZO"]
["trifase","KW","HP"]
["18 l/m",0.75,1,1141]
["18 l/m",1.1000000000000001,1.5,1152]
["18 l/m",1.5,2,1165]
["23 l/m",1.1000000000000001,1.5,1152]
["23 l/m",1.5,2,1165]
["23 l/m",2.2000000000000002,3,1185]
["30 l/m",1.5,2,1302]
["30 l/m",2.2000000000000002,3,1315]
["30 l/m",3,4,1400]
[]
[]
["HL/OIL-265-2V","MOTORI IN OLIO",null,"PREZZO"]
["trifase","KW","HP"]
["18 l/m",0.75,1,1354]
["18 l/m",1.1000000000000001,1.5,1365]
["18 l/m",1.5,2,1378]
["23 l/m",1.1000000000000001,1.5,1365]
["23 l/m",1.5,2,1378]
["23 l/m",2.2000000000000002,3,1398]
["30 l/m",1.5,2,1491]
["30 l/m",2.2000000000000002,3,1502]
["30 l/m",3,4,1508]
[]
[]
[]
["CM3","MOTORI",null,"PREZZO"]
["monofase","KW","HP"]
["15 l/m",1.5,2,1602]
["15 l/m",2.2000000000000002,3,1632]
["23 l/m",1.5,2,1602]
["23 l/m",2.2000000000000002,3,1670]
["23 l/m",2.9,4,1712]
["35 l/m",2.2000000000000002,3,1730]
["35 l/m",2.9,4,1772]
["35 l/m",3.7,5,1807]
["55 l/m",2.9,4,1772]
["55 l/m",3.7,5,1807]
["55 l/m",4.8,6.5,1890]
["55 l/m",6,8,2002]
["75 l/m",3.7,5,1807]
["75 l/m",4.8,6.5,1890]
["75 l/m",6,8,2002]
[]
[]
["CM3","MOTORI",null,"PREZZO"]
["trifase","KW","HP"]
["15 l/m",2,2.7,1512]
["23 l/m",2,2.7,1512]
["23 l/m",3,4,1529]
["35 l/m",2,2.7,1523]
["35 l/m",3,4,1529]
["35 l/m",4.5,6,1535]
["55 l/m",4.5,6,1535]
["55 l/m",6,8,1553]
["75 l/m",4.5,6,1535]
["75 l/m",6,8,1553]
["75 l/m",7.5,10,1613]
["100 l/m",4.5,6,1601]
["100 l/m",6,8,1637]
["100 l/m",7.5,10,1653]
["100 l/m",9.5,13,1680]
["125 l/m",6,8,1637]
["125 l/m",7.5,10,1653]
["125 l/m",9.5,13,1680]
["125 l/m",12,16,1722]
["150 l/m",6,8,1637]
["150 l/m",7.5,10,1653]
["150 l/m",9.5,13,1680]
["150 l/m",12,16,1722]
["150 l/m",15,20,1749]
[]
[]
["CM","MOTORI",null,"PREZZO"]
[null,"KW","HP"]
["55 l/m",4.5,6,1597]
["55 l/m",6,8,1617]
["75 l/m",4.5,6,1597]
["75 l/m",6,8,1617]
["75 l/m",7.5,10,1653]
["100 l/m",4.5,6,1601]
["100 l/m",6,8,1637]
["100 l/m",7.5,10,1653]
["100 l/m",9.5,13,1680]
["125 l/m",6,8,1637]
["125 l/m",7.5,10,1653]
["125 l/m",9.5,13,1680]
["125 l/m",12,16,1722]
["150 l/m",6,8,1637]
["150 l/m",7.5,10,1653]
["150 l/m",9.5,13,1680]
["150 l/m",12,16,1722]
["150 l/m",15,20,1749]
["180 l/m","09:05:00",13,1972]
["180 l/m",12,16,2017]
["180 l/m",15,20,2047]
["180 l/m",18.5,25,2081]
["210 l/m",9.5,13,1972]
["210 l/m",12,16,2017]
["210 l/m",15,20,2047]
["210 l/m",18.5,25,2081]
[]
[]
["CA","MOTORI",null,"PREZZO"]
[null,"KW","HP"]
["55 l/m",4.5,6,1714]
["55 l/m",6,8,1734]
["75 l/m",4.5,6,1714]
["75 l/m",6,8,1734]
["75 l/m",7.5,10,1770]
["100 l/m",4.5,6,1718]
["100 l/m",6,8,1754]
["100 l/m",7.5,10,1770]
["100 l/m",9.5,13,1797]
["125 l/m",6,8,1754]
["125 l/m",7.5,10,1770]
["125 l/m",9.5,13,1797]
["125 l/m",12,16,1839]
["150 l/m",6,8,1754]
["150 l/m",7.5,10,1770]
["150 l/m",9.5,13,1797]
["150 l/m",12,16,1839]
["150 l/m",15,20,1866]
["180 l/m",9.5,13,1978]
["180 l/m",12,16,2022]
["180 l/m",15,20,2051]
["180 l/m",18.5,25,2086]
["210 l/m",9.5,13,1978]
["210 l/m",12,16,2022]
["210 l/m",15,20,2051]
["210 l/m",18.5,25,2086]
["210 l/m",22.5,30,2176]
["250 l/m",15,20,2134]
["250 l/m",18.5,25,2171]
["250 l/m",22.5,30,2275]
["250 l/m",30,40,2389]
[]
[]
["CA/A","MOTORI",null,"PREZZO"]
[null,"KW","HP"]
["55 l/m",4.5,6,1860]
["55 l/m",6,8,1880]
["75 l/m",4.5,6,1860]
["75 l/m",6,8,1880]
["75 l/m",7.5,10,1916]
["100 l/m",4.5,6,1864]
["100 l/m",6,8,1900]
["100 l/m",7.5,10,1916]
["100 l/m",9.5,13,1943]
["125 l/m",6,8,1900]
["125 l/m",7.5,10,1916]
["125 l/m",9.5,13,1943]
["125 l/m",12,16,1985]
["150 l/m",6,8,1900]
["150 l/m",7.5,10,1916]
["150 l/m",9.5,13,1943]
["150 l/m",12,16,1985]
["150 l/m",15,20,2012]
["180 l/m",9.5,13,2124]
["180 l/m",12,16,2168]
["180 l/m",15,20,2197]
["180 l/m",18.5,25,2232]
["210 l/m",9.5,13,2124]
["210 l/m",12,16,2168]
["210 l/m",15,20,2197]
["210 l/m",18.5,25,2232]
["210 l/m",22.5,30,2322]
["250 l/m",15,20,2280]
["250 l/m",18.5,25,2317]
["250 l/m",22.5,30,2421]
["250 l/m",30,40,2535]
["300 l/m",12,16,2310]
["300 l/m",15,20,2341]
["300 l/m",18.5,25,2377]
["300 l/m",22.5,30,2425]
["300 l/m",30,40,2583]
["330 l/m",15,20,2364]
["330 l/m",18.5,25,2392]
["330 l/m",22.5,30,2434]
["330 l/m",30,40,2631]
["330 l/m",37,50,2766]
["380 l/m",15,20,2425]
["380 l/m",18.5,25,2425]
["380 l/m",22.5,30,2442]
["380 l/m",30,40,2681]
["380 l/m",37,50,2789]
[]
[]
["CG","MOTORI",null,"PREZZO"]
[null,"KW","HP"]
["300 l/m",12,16,2542]
["300 l/m",15,20,2573]
["300 l/m",18.5,25,2609]
["300 l/m",22.5,30,2657]
["300 l/m",30,40,2815]
["330 l/m",15,20,2596]
["330 l/m",18.5,25,2624]
["330 l/m",22.5,30,2666]
["330 l/m",30,40,2863]
["330 l/m",37,50,2998]
["380 l/m",15,20,2657]
["380 l/m",18.5,25,2657]
["380 l/m",22.5,30,2674]
["380 l/m",30,40,2913]
["380 l/m",37,50,3021]
["440 l/m",18.5,25,2879]
["440 l/m",22.5,30,3007]
["440 l/m",30,40,3137]
["440 l/m",37,50,3266]
["440 l/m",45,60,3280]
["500 l/m",18.5,25,2879]
["500 l/m",22.5,30,3007]
["500 l/m",30,40,3137]
["500 l/m",37,50,3266]
["500 l/m",45,60,3280]
["500 l/m",60,80,3300]
["650 l/m",22.5,30,3137]
["650 l/m",30,40,3266]
["650 l/m",37,50,3390]
["650 l/m",45,60,3403]
["650 l/m",60,80,3446]
["650 l/m",75,100,3494]
[]
[]
["CIF-2","MOTORI",null,"PREZZO"]
[null,"KW","HP"]
["35 l/m",2,2.7,2121]
["35 l/m",3,4,2126]
["35 l/m",4.5,6,2132]
["55 l/m",4.5,6,2132]
["55 l/m",6,8,2153]
["75 l/m",4.5,6,2132]
["75 l/m",6,8,2153]
["75 l/m",7.5,10,2189]
["100 l/m",4.5,6,2136]
["100 l/m",6,8,2172]
["100 l/m",7.5,10,2189]
["100 l/m",9.5,13,2216]
["125 l/m",6,8,2172]
["125 l/m",7.5,10,2189]
["125 l/m",9.5,13,2216]
["125 l/m",12,16,2258]
["150 l/m",6,8,2172]
["150 l/m",7.5,10,2189]
["150 l/m",9.5,13,2216]
["150 l/m",12,16,2258]
["150 l/m",15,20,2285]
["180 l/m","09:05:00",13,2508]
["180 l/m",12,16,2552]
["180 l/m",15,20,2582]
["180 l/m",18.5,25,2616]
["210 l/m",9.5,13,2508]
["210 l/m",12,16,2552]
["210 l/m",15,20,2582]
["210 l/m",18.5,25,2616]
["210 l/m",22.5,30,2707]
["250 l/m",15,20,2665]
["250 l/m",18.5,25,2702]
["250 l/m",22.5,30,2806]
[]
[]
["CP/V","MOTORI",null,"PREZZO"]
["trifase","KW","HP"]
["15 l/m",2,2.7,1564]
["23 l/m",2,2.7,1564]
["23 l/m",3,4,1608]
["35 l/m",2,2.7,1623]
["35 l/m",3,4,1633]
["35 l/m",4.5,6,1633]
["55 l/m",4.5,6,1633]
["55 l/m",6,8,1650]
["75 l/m",4.5,6,1633]
["75 l/m",6,8,1650]
["75 l/m",7.5,10,1674]
[]
[]
["CP/V","MOTORI",null,"PREZZO"]
["monofase","KW","HP"]
["15 l/m",1.5,2,1666]
["15 l/m",2.2000000000000002,3,1686]
["23 l/m",1.5,2,1666]
["23 l/m",2.2000000000000002,3,1672]
["23 l/m",2.9,4,1712]
["35 l/m",2.2000000000000002,3,1729]
["35 l/m",2.9,4,1769]
["35 l/m",3.7,5,1802]
[]
[]
["CE-320/MB","MOTORI",null,"PREZZO"]
[null,"KW","HP"]
["15 l/m",2,2.7,2438]
["15 l/m",3,4,2454]
["23 l/m",2,2.7,2438]
["23 l/m",3,4,2454]
["23 l/m",4.5,6,2461]
["35 l/m",2,2.7,2449]
["35 l/m",3,4,2454]
["35 l/m",4.5,6,2461]
["55 l/m",3,4,2454]
["55 l/m",4.5,6,2461]
["55 l/m",6,8,2479]
["75 l/m",3,4,2454]
["75 l/m",4.5,6,2461]
["75 l/m",6,8,2479]
["75 l/m",7.5,10,2539]
["100 l/m",4.5,6,2527]
["100 l/m",6,8,2563]
["100 l/m",7.5,10,2579]
["100 l/m",9.5,13,2606]
["100 l/m",12,16,2648]
["125 l/m",4.5,6,2527]
["125 l/m",6,8,2563]
["125 l/m",7.5,10,2579]
["125 l/m",9.5,13,2606]
["125 l/m",12,16,2648]
["125 l/m",15,20,2675]
["150 l/m",6,8,2563]
["150 l/m",7.5,10,2579]
["150 l/m",9.5,13,2606]
["150 l/m",12,16,2648]
["150 l/m",15,20,2675]
[]
[]
["CE/CM-MB","MOTORI",null,"PREZZO"]
[null,"KW","HP"]
["55 l/m",4.5,6,2461]
["55 l/m",6,8,2479]
["75 l/m",4.5,6,2461]
["75 l/m",6,8,2479]
["75 l/m",7.5,10,2539]
["100 l/m",4.5,6,2527]
["100 l/m",6,8,2563]
["100 l/m",7.5,10,2579]
["100 l/m",9.5,13,2606]
["100 l/m",12,16,2648]
["125 l/m",6,8,2563]
["125 l/m",7.5,10,2579]
["125 l/m",9.5,13,2606]
["125 l/m",12,16,2648]
["125 l/m",15,20,2675]
["150 l/m",6,8,2563]
["150 l/m",7.5,10,2579]
["150 l/m",9.5,13,2606]
["150 l/m",12,16,2648]
["150 l/m",15,20,2675]
["180 l/m",9.5,13,2904]
["180 l/m",12,16,2948]
["180 l/m",15,20,2977]
["180 l/m",18.5,25,3012]
["210 l/m",9.5,13,2904]
["210 l/m",12,16,2948]
["210 l/m",15,20,2977]
["210 l/m",18.5,25,3012]
[]
[]
["CE/CA-MB","MOTORI",null,"PREZZO"]
[null,"KW","HP"]
["180 l/m",9.5,13,2904]
["180 l/m",12,16,2948]
["180 l/m",15,20,2977]
["180 l/m",18.5,25,3012]
["210 l/m",9.5,13,2904]
["210 l/m",12,16,2948]
["210 l/m",15,20,2977]
["210 l/m",18.5,25,3012]
["210 l/m",22.5,30,3102]
["250 l/m",15,20,3060]
["250 l/m",18.5,25,3097]
["250 l/m",22.5,30,3201]
["250 l/m",30,40,3315]
["300 l/m",12,16,3586]
["300 l/m",15,20,3617]
["300 l/m",18.5,25,3653]
["300 l/m",22.5,30,3701]
["300 l/m",30,40,3859]
["330 l/m",15,20,3640]
["330 l/m",18.5,25,3668]
["330 l/m",22.5,30,3710]
["330 l/m",30,40,3907]
["380 l/m",15,20,3701]
["380 l/m",18.5,25,3701]
["380 l/m",22.5,30,3718]
["380 l/m",30,40,3957]
[]
[]
["CE/CIF-2-MB","MOTORI",null,"PREZZO"]
[null,"KW","HP"]
["35 l/m",2,2.7,3047]
["35 l/m",3,4,3052]
["35 l/m",4.5,6,3058]
["55 l/m",4.5,6,3058]
["55 l/m",6,8,3079]
["75 l/m",4.5,6,3058]
["75 l/m",6,8,3079]
["75 l/m",7.5,10,3115]
["100 l/m",4.5,6,3062]
["100 l/m",6,8,3098]
["100 l/m",7.5,10,3115]
["100 l/m",9.5,13,3142]
["125 l/m",6,8,3098]
["125 l/m",7.5,10,3115]
["125 l/m",9.5,13,3142]
["125 l/m",12,16,3184]
["150 l/m",6,8,3098]
["150 l/m",7.5,10,3115]
["150 l/m",9.5,13,3142]
["150 l/m",12,16,3184]
["150 l/m",15,20,3211]
["180 l/m","09:05:00",13,3434]
["180 l/m",12,16,3478]
["180 l/m",15,20,3508]
["180 l/m",18.5,25,3542]
["210 l/m",9.5,13,3434]
["210 l/m",12,16,3478]
["210 l/m",15,20,3508]
["210 l/m",18.5,25,3542]
["210 l/m",22.5,30,3633]
["250 l/m",15,20,3591]
["250 l/m",18.5,25,3628]
["250 l/m",22.5,30,3732]

{"sheet":"Prezzo P","index":9,"n_rows":211,"n_cols":15,"rows_kept":211,"cut":false,"hidden":true,"merged":[[44,1,44,14],[38,1,38,14],[1,1,1,14],[10,1,10,14],[19,1,19,14],[29,1,29,14]]}
[]
[null,"Prezzo pistoni primi 3 mt. diretto laterale e in taglia (9130-9140)"]
[null,50,60,70,80,85,90,100,110,120,130,150,160,180,200]
[5,{"$f":"B62","v":452},{"$f":"B64","v":477},{"$f":"B66","v":544},{"$f":"B68","v":582},"x",{"$f":"B72","v":659},{"$f":"B75","v":712},{"$f":"B78","v":830},{"$f":"B81","v":858},{"$f":"B84","v":947},"x","x","x","x"]
[6,"x","x","x","x","x","x","x","x","x","x",{"$f":"B87","v":1156},"x","x","x"]
[7.5,{"$f":"B63","v":488},{"$f":"B65","v":511},{"$f":"B67","v":582},{"$f":"B69","v":617},{"$f":"B71","v":617},{"$f":"B73","v":697},{"$f":"B76","v":763},{"$f":"B79","v":911},{"$f":"B82","v":969},{"$f":"B85","v":1061},"x","x","x","x"]
[10,"x","x","x","x","x","x","x","x","x","x",{"$f":"B88","v":1301},{"$f":"B89","v":1801},{"$f":"B90","v":2177},{"$f":"B91","v":2841}]
[12,"x","x","x",{"$f":"B70","v":675},"x",{"$f":"B74","v":763},{"$f":"B77","v":836},{"$f":"B80","v":984},{"$f":"B83","v":1032},{"$f":"B86","v":1120},"x","x","x","x"]
[]
[]
[null,"Prezzo pistoni metro successivo"]
[null,50,60,70,80,85,90,100,110,120,130,150,160,180,200]
[5,{"$f":"D62","v":47},{"$f":"D64","v":53},{"$f":"D66","v":62},{"$f":"D68","v":71},"x",{"$f":"D72","v":82},{"$f":"D75","v":82},{"$f":"D78","v":109},{"$f":"D81","v":109},{"$f":"D84","v":126},"x","x","x","x"]
[6,"x","x","x","x","x","x","x","x","x","x",{"$f":"D87","v":163},"x","x","x"]
[7.5,{"$f":"D63","v":52},{"$f":"D65","v":61},{"$f":"D67","v":71},{"$f":"D69","v":87},{"$f":"D71","v":87},{"$f":"D73","v":95},{"$f":"D76","v":124},{"$f":"D79","v":126},{"$f":"D82","v":140},{"$f":"D85","v":161},"x","x","x","x"]
[10,"x","x","x","x","x","x","x","x","x","x",{"$f":"D88","v":237},{"$f":"D89","v":281},{"$f":"D90","v":366},{"$f":"D91","v":474}]
[12,"x","x","x",{"$f":"D70","v":101},"x",{"$f":"D74","v":121},{"$f":"D77","v":137},{"$f":"D80","v":157},{"$f":"D83","v":177},{"$f":"D86","v":200},"x","x","x","x"]
[]
[]
[null,"Prezzo pistoni primi 3 mt diretto centrale (9150)"]
[null,50,60,70,80,85,90,100,110,120,130,150,160,180,200]
[5,{"$f":"C62","v":573},{"$f":"C64","v":657},{"$f":"C66","v":684},{"$f":"C68","v":723},"x",{"$f":"C72","v":804},{"$f":"C75","v":858},{"$f":"C78","v":1015},{"$f":"C81","v":1055},{"$f":"C84","v":1268},"x","x","x","x"]
[6,"x","x","x","x","x","x","x","x","x","x",{"$f":"C87","v":1480},"x","x","x"]
[7.5,{"$f":"C63","v":618},{"$f":"C65","v":692},{"$f":"C67","v":723},{"$f":"C69","v":757},{"$f":"C71","v":757},{"$f":"C73","v":846},{"$f":"C76","v":913},{"$f":"C79","v":1072},{"$f":"C82","v":1113},{"$f":"C85","v":1341},"x","x","x","x"]
[10,"x","x","x","x","x","x","x","x","x","x",{"$f":"C88","v":1618},{"$f":"C89","v":1964},{"$f":"C90","v":2381},{"$f":"C91","v":2886}]
[12,"x","x","x",{"$f":"C70","v":876},"x",{"$f":"C74","v":911},{"$f":"C77","v":985},{"$f":"C80","v":1154},{"$f":"C83","v":1207},{"$f":"C86","v":1455},"x","x","x","x"]
[]
[]
[]
[null,"Prezzo giunta pistone"]
[null,50,60,70,80,85,90,100,110,120,130,150,160,180,200]
[5,0,0,{"$f":"E66","v":336},{"$f":"E68","v":351},"x",{"$f":"E72","v":365},{"$f":"E75","v":381},{"$f":"E78","v":449},{"$f":"E81","v":462},{"$f":"E84","v":509},"x","x","x","x"]
[6,"x","x","x","x","x","x","x","x","x","x",{"$f":"E87","v":595},"x","x","x"]
[7.5,0,0,{"$f":"E67","v":338},{"$f":"E69","v":351},{"$f":"E71","v":351},{"$f":"E73","v":365},{"$f":"E76","v":381},{"$f":"E79","v":449},{"$f":"E82","v":462},{"$f":"E85","v":509},"x","x","x","x"]
[10,"x","x","x","x","x","x","x","x","x","x",{"$f":"E88","v":595},{"$f":"E89","v":693},{"$f":"E90","v":987},{"$f":"E91","v":1167}]
[12,"x","x","x",{"$f":"E70","v":378},"x",{"$f":"E74","v":367},{"$f":"E77","v":390},{"$f":"E80","v":461},{"$f":"E83","v":479},{"$f":"E86","v":526},"x","x","x","x"]
[]
[]
[null,"Prezzo guarnizioni"]
[null,50,60,70,80,85,90,100,110,120,130,150,160,180,200]
["testata",{"$f":"B112","v":10},{"$f":"B113","v":10},{"$f":"B114","v":11},{"$f":"B115","v":12},{"$f":"B116","v":15},{"$f":"B117","v":15},{"$f":"B118","v":15},{"$f":"B119","v":16},{"$f":"B120","v":18},{"$f":"B121","v":20},{"$f":"B122","v":23},{"$f":"B123","v":25},{"$f":"B124","v":28},{"$f":"B125","v":32}]
["set g 1",{"$f":"B98","v":18},{"$f":"B99","v":20},{"$f":"B100","v":23},{"$f":"B101","v":25},{"$f":"B102","v":26},{"$f":"B103","v":27},{"$f":"B104","v":28},{"$f":"B105","v":30},{"$f":"B106","v":32},{"$f":"B107","v":39},{"$f":"B108","v":43},{"$f":"B109","v":52},{"$f":"B110","v":58},{"$f":"B111","v":110}]
[]
[]
[null,"Prezzo anello di protezione stelo"]
[null,50,60,70,80,85,90,100,110,120,130,150,160,180,200]
[5,0,0,{"$f":"F66","v":38},{"$f":"F68","v":43},"x",{"$f":"F72","v":50},{"$f":"F75","v":52},{"$f":"F78","v":54},{"$f":"F81","v":61},{"$f":"F84","v":95},"x","x","x","x"]
[6,"x","x","x","x","x","x","x","x","x","x",{"$f":"F87","v":100},"x","x","x"]
[7.5,0,0,{"$f":"F67","v":38},{"$f":"F69","v":43},{"$f":"F71","v":50},{"$f":"F73","v":50},{"$f":"F76","v":52},{"$f":"F79","v":54},{"$f":"F82","v":61},{"$f":"F85","v":95},"x","x","x","x"]
[10,"x","x","x","x","x","x","x","x","x","x",{"$f":"F88","v":100},{"$f":"F89","v":105},{"$f":"F90","v":126},{"$f":"F91","v":160}]
[12,"x","x","x",{"$f":"F70","v":43},"x",{"$f":"F74","v":50},{"$f":"F77","v":52},{"$f":"F80","v":54},{"$f":"F83","v":61},{"$f":"F86","v":95},"x","x","x","x"]
[]
[]
[]
[]
[]
[]
["LISTINO PISTONI"]
[null,9130]
[null,9140,9150]
["tipo","3 m","3 m","1 m","guinta","protez."]
["  50 x 5",452,573,47,"nd","nd"]
["  50 x 7,5",488,618,52,"nd","nd"]
["  60 x 5",477,657,53,"nd","nd"]
["  60 x 7,5",511,692,61,"nd","nd"]
["  70 x 5",544,684,62,336,38]
["  70 x 7,5",582,723,71,338,38]
["  80 x 5",582,723,71,351,43]
["  80 x 7,5",617,757,87,351,43]
["  80 x 12",675,876,101,378,43]
["  85 x 7,5",617,757,87,351,50]
["  90 x 5",659,804,82,365,50]
["  90 x 7,5",697,846,95,365,50]
["  90 x 12",763,911,121,367,50]
["100 x 5",712,858,82,381,52]
["100 x 7,5",763,913,124,381,52]
["100 x 12",836,985,137,390,52]
["110 x 5",830,1015,109,449,54]
["110 x 7,5",911,1072,126,449,54]
["110 x 12",984,1154,157,461,54]
["120 x 5",858,1055,109,462,61]
["120 x 7,5",969,1113,140,462,61]
["120 x 12",1032,1207,177,479,61]
["130 x 5 ",947,1268,126,509,95]
["130 x 7,5",1061,1341,161,509,95]
["130 x 12",1120,1455,200,526,95]
["150 x 6",1156,1480,163,595,100]
["150 x 10",1301,1618,237,595,100]
["160 x 10",1801,1964,281,693,105]
["180 x 10",2177,2381,366,987,126]
["200 x 10",2841,2886,474,1167,160]
[]
["piastra MI",69]
[]
[]
["LISTINO GUARNIZIONI"]
["DESCRIZIONE","PREZZO €"]
["serie 50 mm",18]
["serie 60 mm",20]
["serie 70 mm",23]
["serie 80 mm",25]
["serie 85 mm",26]
["serie 90 mm",27]
["serie 100 mm",28]
["serie 110 mm",30]
["serie 120 mm",32]
["serie 130 mm",39]
["serie 150 mm",43]
["serie 160 mm",52]
["serie 180 mm",58]
["serie 200 mm",110]
["balsele 50 mm",10]
["balsele 60 mm",10]
["balsele 70 mm",11]
["balsele 80 mm",12]
["balsele 85 mm",15]
["balsele 90 mm",15]
["balsele 100 mm",15]
["balsele 110 mm",16]
["balsele 120 mm",18]
["balsele 130 mm",20]
["balsele 150 mm",23]
["balsele 160 mm",25]
["balsele 180 mm",28]
["balsele 200 mm",32]
[]
[]
["Pressostato tarabile da 5 a 70 bar, contatto di scambio (NA+NC)","5304/1",55]
["pompa a mano di manovra in salita","POM.MAN.INT",106]
["attacco manometro ispezione en 81.2",224.04236111111109,19]
["tuboflex ¾\" (primo metro) dir-90°","TF3/4\"-M01.0",41]
["tuboflex ¾\" (metro successivo)","TF3/4\"-M00.0",11]
["tuboflex 1\"  (primo metro) dir-90°","TF1\"1-M01.0",49]
["tuboflex 1\"  (metro successivo)","TF1\"1-M00.0",15]
["tuboflex 1\" 1/4  (primo metro) dir-90°","TF1\"1/4-M01.0",67]
["tuboflex 1\" 1/4  (metro successivo)","TF1\"1/4-M00.0",23]
["tuboflex 1\" 1/2 (primo metro) dir-90°","TF1\"1/2-M01.0",93]
["tuboflex 1\" 1/2  (metro successivo)","TF1\"1/2-M00.0",31]
["tuboflex 2\"   (primo metro) dir-dir","TF-2\"-M01.0",104]
["tuboflex 2\"   (metro successivo)","TF-2\"-M00.0",41]
["barra tubo mandata diametro 28 x 2 (m 6)","5437 / P",48]
["barra tubo mandata diametro 35 x 2,5 (m 6)","5438 / P",68]
["barra tubo mandata diametro 42 x  3   (m 6)","5439 / P",97]
["staffa fissaggio per barre tubo F 35 e tuboflex ¾” e 1”","STAF.TUB.35",8]
["staffa fissaggio per barre tubo mandata diametro F 42","STAF.TUB.42",8]
["staffa fissaggio per tuboflex 1” ¼","STAF.TU.1\"1/4",8]
["staffa fissaggio per tuboflex  1” ½","STAF.TU.1\"1/2",8]
["staffa fissaggio per tuboflex  2”","STAF.TU.2”G",11]
["raccordo 90° uscita verticale centralina diam. 28","KIT.RACC/VER28",12]
["raccordo 90° uscita verticale centralina diam. 35","KIT.RACC/VER35",22]
["raccordo 90° uscita verticale centralina diam. 42","KIT.RACC/VER42",29]
["raccordo uscita orizzontale centralina diam. 35","KIT.RACC/ORR35",22]
["raccordo uscita orizzontale centralina diam. 42","KIT.RACC/ORR42",29]
["raccordo di giunzione diritto diam. 35",5308,16]
["raccordo di giunzione diritto diam. 42",5309,21]
["raccordo di giunzione  a 90 ° diam. 35",5310,22]
["raccordo di giunzione  a 90 ° diam. 42",5311,29]
[]
[]
["Raccordo 3 vie a ‘T’   1\" ¼  (con raccordi)",5316,59]
["Raccordo 3 vie a ‘T’  1\" ½ x 1\" ¼ x 1\" ¼  (con raccordi)","RACC.T42+2/35",70]
["Raccordo 3 vie a ‘T’  1\" ½  (con raccordi)",5317,70]
["Raccordo 3 vie a ‘Y’  1\" ½ x 1\" ¼ x 1\" ¼ (senza raccordi)","0696/2",103]
["Raccordo 3 vie a ‘Y’  1\" ½ (senza raccordi)","0696/1",103]
["Raccordo 3 vie a ‘Y’  2\" x 1\" ½  x 1\" ½  (senza raccordi)",696,160]
["Raccordo 3 vie a ‘Y’  2\"  (senza raccordi)","0696/3",177]
["nipplo 1\"1/4 per raccordo a tre vie Y  1\" ¼",5306,20]
["nipplo 1\"1/2 per raccordo a tre vie Y  1\" ½",5307,20]
["nipplo 2\" per raccordo a tre vie Y  2\"",5325,22]
["tubo miniflex per collegamento valvole paracadute  F 8  - m 5",5425,35]
["raccordi per tubo miniflex F 8 serie di due","RACC.90/VP-MF",6]
["Raccordo intermedio per tubo miniflex F 8","5307/5",3]
["kit staffe per avvitamento pistone in due pezzi  F 70 -  F 120 (Qt. 2)","2x 0745",279]
["kit staffe per avvitamento pistone in due pezzi  F 130 -  F 200 (Qt. 2)","2x 0747",321]
["carta catramata – rotolo lungh. 10 m largh. 10 cm -","5256/5",35]
["armadio da assemblare su centralina CM-320/A","0884/CM3-A-SC",402]
["armadio – MI 2000, mod. CM3/R – (serbatoio CM-320/AR)","0884/CM3R2A-150",598]
["armadio – MI 2000, mod. CM3 – (serbatoio CM-320)","0884/CM32A-150",598]
["armadio – MI 2000, mod. CM3 – (serbatoio CM-320, versione smontata)","0884/CM32A-150.SM",501]
["armadio – MI 2000, mod. CM – (serbatoio CM)","0884/CMVMO2A-150",644]
["armadio – MI 2000, mod. CA – (serbatoio CA)","0884/CAVMO2A",697]
["armadio completo per centralina HL-300/AR","0946/300-COMPL.",316]
["armadio completo per centralina HL-420/AR","0946/420-COMPL.",316]
["armadio completo per centralina HL-300/AR – smontato","0946/300-COMPL.SM.",324]
["armadio completo per centralina HL-420/AR – smontato","0946/420-COMPL.SM.",324]
["armadio completo per centralina HL/OIL-265","0946/HL-OIL",324]
["pompa di microlivellamento  20  l/m – 3 HP per CA","MICR.COM20/3-CA",976]
["pompa di microlivellamento  20  l/m – 3 HP per CG ","MICR.COM20/3-CG",976]
["microlivellamento in discesa 15/250 l/m (fornitura con centralina)","MICR.D/250-IN",118]
["microlivellamento in discesa 300/650 l/m (fornitura con centralina)","MICR.D/650-IN",178]
["resistenza 400W  230V  con termostato","RIS.CON TER",27]
["resistenza 400W  400V  con termostato","RIS.CON TE/400",27]
["resistenza 400W  230V  con termostato per centraline HL","RIS.CON TE/HL",27]
[]
[]
["scambiatore di calore modello scamb. 5/10 con 2 tubi da mt. 3","SCAMB.5/10M-3",1382]
["scambiatore di calore modello scamb. 20  con 2 tubi da mt. 3","SCAMB.20M-3",1506]
["scambiatore di calore modello scamb. 30 con 2 tubi da mt. 3","SCAMB.30M-3",1832]
["scamb. di calore SCAMB.5/10 con 2 tubi da 3 m e quadro elettrico di comando","SCASE 5/10",1714]
["scamb. di calore SCAMB.20 con 2 tubi da 3 m e quadro elettrico di comando","SCASE 20",1961]
["scamb. di calore SCAMB.30 con 2 tubi da 3 m e quadro elettrico di comando","SCASE 30",2163]
["predisposizione centralina per scambiatore di calore con rubinetti","CASS.PRED.GAR",74]
["lamiera anticaduta oggetti per serbatoio CM  (55 – 210 l/m)","RIP.C.O.CB/CM",14.5]
["lamiera anticaduta oggetti per serbatoio CA (180 l/m)","RIP.C.O.CA180",14.5]
["lamiera anticaduta oggetti per serbatoio CA (210 – 380 l/m)","RIP.C.O.CA300",14.5]
["lamiera anticaduta oggetti per serbatoio CA/A (380 l/m)","RIP.C.O.CA380",14.5]
["lamiera anticaduta oggetti per serbatoio CG (440 – 650 l/m)","RIP.C.O.CG",21]
["soft stop + reg. 21/250","SOFT STOP 250",101]
["soft stop + reg. 21/380","SOFT STOP 380/MO",177]
["soft stop + reg. 21/650","SOFT STOP 650/MO",177]
["amplificatore protezione motore","5001/3",110]

{"sheet":"database1","index":10,"n_rows":120,"n_cols":19,"rows_kept":120,"cut":false,"hidden":false,"merged":[]}
[]
[]
["CARATTERISTICHE GEOMETRICHE PER IL CALCOLO DEGLI STELI"]
[]
[]
[null,null,null,null,null,null,"DIAMETRO PISTONE"]
[null,null,"SPESSORE",36,50,60,70,80,85,90,100,110,120,130,150,160,180,200]
["SEZIONE","Ax0",0,1018,"x","x","x","x","x","x","x","x","x","x","x","x","x","x"]
["RESISTENTE","Ax5",5,"x",707,864,1021,1178,"x",1335,1492,1649,1806,1963,"x","x","x","x"]
["A","Ax6",6,"x","x","x","x","x","x","x","x","x","x","x",2713,"x","x","x"]
["mm2","Ax7,5",7.5,"x",1001,1237,1472,1708,1826,1943,2179,2415,2650,2885,"x","x","x","x"]
[null,"Ax10",10,"x","x","x","x","x","x","x","x","x","x","x",4398,4712,5340,5969]
[null,"Ax12",12,"x","x","x","x",2563,"x",2940,3317,3694,4071,4448,"x","x","x","x"]
["RAGGIO ","ix0",0,9,"x","x","x","x","x","x","x","x","x","x","x","x","x","x"]
["D' INERZIA","ix5",5,"x",16,19.53,23.05,26.58,"x",30.1,33.630000000000003,37.17,40.700000000000003,44.23,"x","x","x","x"]
["I","ix6",6,"x","x","x","x","x","x","x","x","x","x","x",50.96,"x","x","x"]
["mm","ix7,5",7.5,"x",15.26,18.75,22.26,25.77,27.53,29.29,32.81,36.340000000000003,39.85,43.39,"x","x","x","x"]
[null,"ix10",10,"x","x","x","x","x","x","x","x","x","x","x",49.62,53.15,60.21,67.27]
[null,"ix12",12,"x","x","x","x",24.41,"x",27.9,31.4,34.909999999999997,38.42,41.93,"x","x","x","x"]
["MOMENTO","Jx0",0,82400,"x","x","x","x","x","x","x","x","x","x","x","x","x","x"]
["D' INERZIA","Jx5",5,"x",181132,329376,542415,832031,"x",1210004,1688115,2278145,2991876,3841087,"x","x","x","x"]
["J","Jx6",6,"x","x","x","x","x","x","x","x","x","x","x",7047770,"x","x","x"]
["mm4","Jx7,5",7.5,"x",233134,434883,729408,1134380,1383802,1667469,2346347,3188687,4212139,5434415,"x","x","x","x"]
[null,"Jx10",10,"x","x","x","x","x","x","x","x","x","x","x",10830641,13312499,19360065,27009843]
[null,"Jx12",12,"x","x","x","x",1527870,"x",2289205,3271075,4501764,6009542,7822664,"x","x","x","x"]
[null,"Pr0",0,8,"x","x","x","x","x","x","x","x","x","x","x","x","x","x"]
["MASSA/LUN.","Prx5",5,"x",5.5,6.7,7.9,9.1999999999999993,"x",10.4,11.7,12.9,14.1,15.3,"x","x","x","x"]
[null,"Prx6",6,"x","x","x","x","x","x","x","x","x","x","x",21.2,"x","x","x"]
["Y","Prx7,5",7.5,"x",7.8,9.6,11.5,13.3,14.3,15.2,17.100000000000001,18.899999999999999,20.7,22.5,"x","x","x","x"]
[null,"Prx10",10,"x","x","x","x","x","x","x","x","x","x","x",34.4,36.799999999999997,41.7,46.6]
["kg/m","Prx12",12,"x","x","x","x",20,"x",23,25.9,28.9,31.8,34.700000000000003,"x","x","x","x"]
["peso giunta","Prx0",0,"x","x","x","x","x","x","x","x","x","x","x","x","x","x","x"]
["stelo","Prx5",5,"x","x","x",5.0999999999999996,7.3,"x",9.6,13.2,25,25,32.5,"x","x","x","x"]
[null,"Prx6",6,"x","x","x","x","x","x","x","x","x","x","x",47.6,"x","x","x"]
[null,"Prx7,5",7.5,"x","x","x",4.2,6.4,7.3,8.5,11.7,14.6,22.8,30.8,"x","x","x","x"]
["kg","Prx10",10,"x","x","x","x","x","x","x","x","x","x","x",42.1,49,74.5,106.5]
[null,"Prx12",12,"x","x","x","x",4.5,"x",6.5,8.6999999999999993,11.9,14.9,23.1,"x","x","x","x"]
[null,"Prx0",0,"x","x","x","x","x","x","x","x","x","x","x","x","x","x","x"]
["peso pistone","Prx5",5,"x",60,64,75,79,"x",96,107,126,131,153,"x","x","x","x"]
["primi 3 m","Prx6",6,"x","x","x","x","x","x","x","x","x","x","x",194,"x","x","x"]
[9130,"Prx7,5",7.5,"x",64,71,84,91,94,109,122,144,152,175,"x","x","x","x"]
[null,"Prx10",10,"x","x","x","x","x","x","x","x","x","x","x",236,309,357,444]
["kg","Prx12",12,"x","x","x","x",110,"x",134,150,175,186,214,"x","x","x","x"]
[null,"Prx0",0,"x","x","x","x","x","x","x","x","x","x","x","x","x","x","x"]
["peso pistone","Prx5",5,"x",64,68,79,83,"x",100,111,133,138,160,"x","x","x","x"]
["primi 3 m","Prx6",6,"x","x","x","x","x","x","x","x","x","x","x",201,"x","x","x"]
[9140,"Prx7,5",7.5,"x",68,75,88,95,98,113,126,151,159,182,"x","x","x","x"]
[null,"Prx10",10,"x","x","x","x","x","x","x","x","x","x","x",243,"x","x","x"]
["kg","Prx12",12,"x","x","x","x",114,"x",138,154,182,193,221,"x","x","x","x"]
[null,"Prx0",0,"x","x","x","x","x","x","x","x","x","x","x","x","x","x","x"]
["peso pistone","Prx5",5,"x",97,101,113,117,"x",132,143,184,189,211,"x","x","x","x"]
["primi 3 m","Prx6",6,"x","x","x","x","x","x","x","x","x","x","x",252,"x","x","x"]
[9150,"Prx7,5",7.5,"x",101,108,122,129,132,145,158,202,210,233,"x","x","x","x"]
[null,"Prx10",10,"x","x","x","x","x","x","x","x","x","x","x",294,415,461,543]
["kg","Prx12",12,"x","x","x","x",148,"x",170,186,233,244,272,"x","x","x","x"]
[null,"Prx0",0,"x","x","x","x","x","x","x","x","x","x","x","x","x","x","x"]
["peso pistone","Prx5",5,"x",15,16,20,21,"x",26,28,33,34,40,"x","x","x","x"]
["metro","Prx6",6,"x","x","x","x","x","x","x","x","x","x","x",50,"x","x","x"]
["successivo","Prx7,5",7.5,"x",16,19,23,25,26,30,33,39,41,47,"x","x","x","x"]
[null,"Prx10",10,"x","x","x","x","x","x","x","x","x","x","x",63,79,90,113]
["kg","Prx12",12,"x","x","x","x",31,"x",38,42,49,52,59,"x","x","x","x"]
[null,"Prx0",0,"x","x","x","x","x","x","x","x","x","x","x","x","x","x","x"]
["peso giunta","Prx5",5,"x","x","x",11,13,"x",17,23,29,37,45,"x","x","x","x"]
["pistone","Prx6",6,"x","x","x","x","x","x","x","x","x","x","x",66,"x","x","x"]
[null,"Prx7,5",7.5,"x","x","x",10,12,13,16,21,26,34,42,"x","x","x","x"]
[null,"Prx10",10,"x","x","x","x","x","x","x","x","x","x","x",61,70,100,134]
["kg","Prx12",12,"x","x","x","x",10,"x",14,18,23,26,36,"x","x","x","x"]
[]
[]
["CARATTERISTICHE GEOMETRICHE CILINDRO"]
[null,null,"PISTONE"]
["d","mm",36,50,60,70,80,85,90,100,110,120,130,150,160,180,200]
["e cyl","mm","x",3.6,3.6,4,4,4,4.5,4.5,5,5,5.6,5.9,8,8,10]
["D","mm","x",101.6,101.6,114.3,114.3,114.3,133,139.69999999999999,159,159,177.8,193.7,219.1,244.5,273]
["e1","mm","x",20,20,20,20,20,20,20,28,28,28,28,35,35,35]
["D1","mm","x",94.4,94.4,106.3,106.3,106.3,124,130.69999999999999,149,149,166.6,181.1,203.1,228.5,253]
["r1","mm",5,5,5,5,5,5,5,5,6,6,6,6,7,7,7]
["s1","mm",4.9000000000000004,4.3,4.3,4.9000000000000004,4.9000000000000004,4.9000000000000004,5.5,5.2,6,6,6.7,7.5,9.5,9.3000000000000007,11.5]
["h1","mm",20,20,20,20,20,20,20,20,28,28,28,28,35,35,35]
["u1","mm",6.2,5.6,5.6,6.2,6.2,6.2,7.2,7.5,8.4,8.4,9.3000000000000007,10.1,11.2,12.6,13.9]
["olio tot",null,"x",7,7,9,9,9,12.2,13.5,17.5,17.5,22,26,32.5,41,50]
["olio circolo",null,"x",{"$f":"ROUND(POWER(D72/200,2)*PI()*10,2)","v":1.96},{"$f":"ROUND(POWER(E72/200,2)*PI()*10,2)","v":2.83},3.85,5.03,5.67,6.36,7.85,9.5,11.31,13.27,17.670000000000002,20.11,25.45,31.42]
["g (0367/2-P)","mm",46,46,46,46,46,46,46,46,53,53,51,53,50,52,44,null,"COTA Y+5"]
["Qf mm",9130,"x",200,200,200,200,200,200,200,215,215,215,215,260,260,260]
["Qf mm",9140,"x",235,235,235,235,235,235,235,250,250,250,250,"x","x","x"]
["Qf mm",9150,"x",235,235,235,235,235,235,235,250,250,250,250,295,295,295]
[]
[]
["CARATTERISTICHE GEOMETRICHE CILINDRO MCE/S"]
[null,null,"PISTONE"]
["d","mm","X","X","X",70,80]
["e cyl","mm",null,null,null,3.7,3.7]
["D","mm",null,null,null,90,100]
["e1","mm",null,null,null,20,84.5]
["D1","mm",null,null,null,82.6,92.6]
["r1","mm",null,null,null,5,5]
["s1","mm",null,null,null,4.9000000000000004,4.9000000000000004]
["h1","mm",null,null,null,20,20]
["u1","mm",null,null,null,6.2,6.2]
["olio tot",null,"x",null,"x",5.36,6.73,"x","x","x","x","x","x","x","x","x","x"]
["olio circolo",null,"x",null,"x",{"$f":"ROUND(POWER(F91/200,2)*PI()*10,2)","v":3.85},5.03,"x","x","x","x","x","x","x","x","x","x"]
["g (0367/2-P)","mm","x",null,"x",32,32,"x","x","x","x","x","x","x","x","x","x","COTA Y+5"]
["Qf mm","MCE","x",null,"x",243,243,"x","x","x","x","x","x","x","x","x","x"]
["Qf mm","MCS","x",null,"x",173,173,"x","x","x","x","x","x","x","x","x","x"]
[]
["CARATTERISTICHE GEOMETRICHE CILINDRO  CRA "]
[null,null,"PISTONE"]
["d","mm",36,"X",60,"X","X"]
["e cyl","mm",5.3,null,5.3]
["D","mm",60,null,80]
["e1","mm",50,null,50]
["D1","mm",49.7,null,69.400000000000006]
["r1","mm",5,null,5]
["s1","mm",4.9000000000000004,null,4.9000000000000004]
["h1","mm",20,null,20]
["u1","mm",6.2,null,6.2]
["olio tot",null,7,"x",7,"x","x","x","x","x","x","x","x","x","x","x","x"]
["olio circolo",null,{"$f":"ROUND(POWER(C108/200,2)*PI()*10,2)","v":1.02},"x",{"$f":"ROUND(POWER(E108/200,2)*PI()*10,2)","v":2.83},"x","x","x","x","x","x","x","x","x","x","x","x"]
["g (0367/2-P)","mm",55,"x",55,"x","x","x","x","x","x","x","x","x","x","x","x"]
["Qf mm","CRA",222,"x",222,"x","x","x","x","x","x","x","x","x","x","x","x"]

{"sheet":"accessori centralina","index":11,"n_rows":75,"n_cols":11,"rows_kept":75,"cut":false,"hidden":false,"merged":[]}
[4]
[{"$f":"INDEX(lingue!B58:E58,1,$A$1)","v":"Descuento"},null,0]
[{"$f":"INDEX(lingue!B135:E135,1,$A$1)","v":"Cantidad"},null,{"$f":"DATOS!D13*IF(OR(DATOS!K12=1,DATOS!K12=2),1,0)","v":1},null,null,{"$f":"INDEX(lingue!B136:E136,1,$A$1)","v":"Qt"},{"$f":"INDEX(lingue!B137:E137,1,$A$1)","v":"precio €"}]
[{"$f":"INDEX(lingue!B138:E138,1,$A$1)","v":"Pistón"},{"$f":"DATOS!D24","v":70},{"$f":"INDEX(lingue!B139:D139,1,$A$1)","v":{"$error":"#REF!"}},{"$f":"DATOS!D25","v":5},"3 mt",{"$f":"1*C3","v":1},null,{"$f":"IF(B5=9150,INDEX('Prezzo P'!B22:O26,J5,J4),INDEX('Prezzo P'!B4:O8,J5,J4))*C3","v":544},"prametro 3mt.",{"$f":"MATCH(B4,'Prezzo P'!B3:O3,0)","v":3}]
[{"$f":"INDEX(lingue!B140:E140,1,$A$1)","v":"modelo"},{"$f":"DATOS!D7","v":9130},null,"m",null,{"$f":"IF(DATOS!D21<3000,0,DATOS!D21-3000)/1000","v":0},{"$f":"(INDEX('Prezzo P'!$B$13:$O$17,$J$5,$J$4))","v":62},{"$f":"G5*F5*C3","v":0},"parametro 3mt",{"$f":"MATCH(D4,'Prezzo P'!A4:A8,0)","v":1}]
[{"$f":"INDEX(lingue!B141:E141,1,$A$1)","v":"en 2 piezas"},null,null,null,null,null,null,{"$f":"INDEX('Prezzo P'!B32:O36,J5,J4)*IF(DATOS!D14>1,1,0)*C3","v":0}]
[{"$f":"INDEX(lingue!B142:E142,1,$A$1)","v":"en 3 piezas"},null,null,null,null,null,null,{"$f":"H6*1.2*(DATOS!D14-2)","v":0},"indice",{"$f":"IF(OR(DATOS!D7=\"MCE\",DATOS!D7=\"MCS\"),MATCH(DATOS!D7,database1!B103:B104,0),IF(DATOS!D7=\"CRA\",MATCH(DATOS!D7,database1!B120:B120,0),MATCH(DATOS!D7,database1!B84:B86,0)))","v":1},"indice del tipo di pistone (9130, 9140 o 9150/MCE/S)"]
[{"$f":"INDEX(lingue!B143:E143,1,$A$1)","v":"ram head gasket"},null,null,null,null,0,{"$f":"INDEX('Prezzo P'!$B$41:$O$42,J8,$J$4)","v":11},{"$f":"G8*F8*$C$3","v":0},"para ",1]
[{"$f":"INDEX(lingue!B144:E144,1,$A$1)","v":"set of jack gasket"},null,null,null,null,0,{"$f":"INDEX('Prezzo P'!$B$41:$O$42,J9,$J$4)","v":23},{"$f":"G9*F9*$C$3","v":0},"para",2]
[{"$f":"INDEX(lingue!B145:E145,1,$A$1)","v":"Lower piston plate (MI plate)"},null,null,null,null,{"$f":"IF(B5=9140,1,0)","v":0},69,{"$f":"G10*F10*$C$3","v":0}]
["anello di protezone",null,null,null,null,null,null,{"$f":"INDEX('Prezzo P'!B47:O51,J5,J4)*C3*DATOS!D26","v":0}]
[null,null,null,null,null,null,null,{"$f":"G12*F12*$C$3","v":0}]
[{"$f":"CONCATENATE(INDEX(lingue!B58:E58,1,$A$1),\" \",INDEX(lingue!B138:E138,1,$A$1))","v":"Descuento Pistón"},null,null,null,null,null,null,{"$f":"C2","v":0}]
[{"$f":"CONCATENATE(INDEX(lingue!B148:E148,1,$A$1),\" \",INDEX(lingue!B138:E138,1,$A$1))","v":"Price list Pistón"},null,null,null,null,null,null,{"$f":"IF(C3=0,0,SUM(H4:H12))","v":544}]
[{"$f":"CONCATENATE(INDEX(lingue!B149:E149,1,$A$1),\" \",INDEX(lingue!B138:E138,1,$A$1))","v":"Net Price Pistón"},null,null,null,null,null,null,{"$f":"H14*(100-H13)/100","v":544}]
[{"$f":"INDEX(lingue!B150:E150,1,$A$1)","v":"Quantity Power Unit"},null,{"$f":"DATOS!D43*IF(OR(DATOS!K12=1,DATOS!K12=3),1,0)","v":1}]
[{"$f":"INDEX(lingue!B151:E151,1,$A$1)","v":"power unit"},{"$f":"IF(OR(DATOS!D65=\"HL-300\",DATOS!D65=\"HL-420\",DATOS!D65=\"HL-420-2V\",DATOS!D65=\"HL/OIL-265\",DATOS!D65=\"HL/OIL-265-2V\"),\"HL\",DATOS!D65)","v":"MS-A/K"},{"$f":"INDEX(lingue!B153:D153,1,$A$1)","v":{"$error":"#REF!"}},{"$f":"CONCATENATE(B19,B17,IF(C18=\"M\",\"M\",),IF(AND(DATOS!D49=2,DATOS!D44=\"HL\"),\"D\",\"\"),IF(AND(DATOS!D48=\"O\",DATOS!D44=\"HL\"),\"-OIL\",\"\"))","v":"55MS-A/K"}]
[{"$f":"INDEX(lingue!B154:E154,1,$A$1)","v":"power"},{"$f":"DATOS!D59","v":6},{"$f":"DATOS!H46","v":"T"},"para-1",{"$f":"MATCH(D17,centraline!A3:A116,0)","v":{"$error":"#N/A"}},null,null,{"$f":"INDEX(centraline!B3:Y116,E18,E19)*C16","v":{"$error":"#N/A"}}]
[{"$f":"INDEX(lingue!B155:E155,1,$A$1)","v":"flow rate"},{"$f":"DATOS!D45","v":55},null,"para-2",{"$f":"MATCH(B18,centraline!B2:Y2,0)","v":13}]
[{"$f":"INDEX(lingue!B156:E156,1,$A$1)","v":"rupture valve"},null,{"$f":"IF(B17=\"HL\",IF(B19<=23,centraline!F132,\"1\"\"\"),INDEX(centraline!C132:F132,1,G20))","v":"1\"1/4"},"portata a pistone",null,{"$f":"B19/DATOS!D13*DATOS!D43","v":55},{"$f":"SUM(MATCH(F20,centraline!B131:F131,1))","v":1},null,"para"]
[null,null,null,null,null,null,{"$f":"SUM(MATCH(B19,centraline!B131:F131,1))","v":1},null,"para Centr.",{"$f":"MATCH(B17,centraline!B121:M121,0)","v":{"$error":"#N/A"}},"Rupture valve"]
[{"$f":"INDEX(lingue!B157:E157,1,$A$1)","v":"over size tank"},null,null,null,null,0,null,{"$f":"INDEX(centraline!$B$122:$M$129,J22,$J$21)*F22*C16","v":{"$error":"#N/A"}},"para ",{"$f":"MATCH(K22,centraline!$A$122:$A$127,0)","v":1},"cassone maggiorato"]
[{"$f":"INDEX(lingue!B158:E158,1,$A$1)","v":"star delta"},null,null,null,null,{"$f":"IF(B18>9.5,1,0)","v":0},{"$f":"F23*IF(DATOS!D51=\"ELE\",0,1)*IF(SUM(F34:F36)=0,1,0)","v":0},{"$f":"INDEX(centraline!$B$122:$M$129,J23,$J$21)*F23*C16*G23","v":{"$error":"#N/A"}},"para",{"$f":"MATCH(K23,centraline!$A$122:$A$127,0)","v":2},"stella triangolo"]
[{"$f":"INDEX(lingue!B161:E161,1,$A$1)","v":"motor protection amplifier"},null,null,null,null,0,110,{"$f":"F24*G24*C16","v":0},"5001/3",null,"amplificatore protezione motore "]
[{"$f":"INDEX(lingue!B163:E163,1,$A$1)","v":"internal plate"},null,null,null,null,0,null,{"$f":"INDEX(centraline!$B$122:$M$129,J25,$J$21)*F25*C16","v":{"$error":"#N/A"}},"para",{"$f":"MATCH(K25,centraline!$A$122:$A$128,0)","v":7},"lamiera interna"]
[{"$f":"INDEX(lingue!B165:E165,1,$A$1)","v":"tank arrangement for heat exchanger"},null,null,null,null,{"$f":"IF(SUM('accessori vari'!A65:A70)>0,1,0)","v":0},74,{"$f":"G26*F26*$C$16","v":0},"CASS.PRED.GAR"]
[{"$f":"INDEX(lingue!B166:E166,1,$A$1)","v":"Pressure switch, 5-70 bar, NO+NC, wired as"},null,null,null,{"$f":"INDEX(DATOS!AG2:AG3,DATOS!K20,1)","v":"N.C."},1,55,{"$f":"G27*F27","v":55},"5304/1"]
[{"$f":"INDEX(lingue!B182:E182,1,$A$1)","v":"Pressure sensor CHD 100 (DINACELL)"},null,null,null,null,0,484,{"$f":"G28*F28*$C$16","v":0},"CHD-100"]
[{"$f":"INDEX(lingue!B167:E167,1,$A$1)","v":"hand pump"},null,null,null,null,1,106,{"$f":"G29*F29","v":106},"POM.MAN.INT"]
[{"$f":"INDEX(lingue!B168:E168,1,$A$1)","v":"exclusion pressure gauge tap En 81.2"},null,null,null,null,{"$f":"IF(DATOS!D51=\"ELE\",0,1)","v":1},19,{"$f":"G30*F30","v":19},"5377.1"]
[{"$f":"INDEX(lingue!B169:E169,1,$A$1)","v":"oil heater 400W 230V for tank"},null,null,null,null,{"$f":"IF(SUM(F34:F36)>0,1,0)","v":0},27,{"$f":"G31*F31*$C$16","v":0},"RIS.CON TER"]
[{"$f":"INDEX(lingue!B170:E170,1,$A$1)","v":"oil heater 400W 400V for tank"},null,null,null,null,0,27,0,"RIS.CON TE/400"]
[{"$f":"INDEX(lingue!B171:E171,1,$A$1)","v":"oil heater 200W 230V for HL tank"},null,null,null,null,0,27,0,"RIS.CON TE/HL"]
[{"$f":"INDEX(lingue!B173:E173,1,$A$1)","v":"soft stop + screw #21 (for 15-250 l/min pumps)"},null,null,null,null,0,101,0,"SOFT STOP 250"]
[{"$f":"INDEX(lingue!B174:E174,1,$A$1)","v":"soft stop + screw #21 (for 300-380 l/min pumps)"},null,null,null,null,0,177,0,"SOFT STOP 380/MO"]
[{"$f":"INDEX(lingue!B175:E175,1,$A$1)","v":"soft stop + screw #21 (for 440-650 l/min pumps)"},null,null,null,null,0,177,0,"SOFT STOP 650/MO"]
[{"$f":"INDEX(lingue!B176:E176,1,$A$1)","v":"down re-levelling electrovalve (for 15 to 250 l/min pumps)"},null,null,null,null,{"$f":"IF(AND(DATOS!D19=2,DATOS!D45<=250),1,0)","v":0},118,0,"MICR.D/250-IN"]
[{"$f":"INDEX(lingue!B177:E177,1,$A$1)","v":"down re-levelling electrovalve (for 300 to 650 l/min pumps)"},null,null,null,null,{"$f":"IF(AND(DATOS!D19=2,DATOS!D45>250),1,0)","v":0},178,0,"MICR.D/650-IN"]
[{"$f":"INDEX(lingue!B128:E128,1,$A$1)","v":"Bomba de micronivelación 20 l/min - 3 CV"},null,null,null,null,0,976,0,"MICR.COM20/3"]
[{"$f":"INDEX(lingue!B274:E274,1,$A$1)","v":"emergency lowering valve 12 VDC for electronic power unit"},null,null,null,null,0,80,0,"MICR.D/250-IN-MB"]
[{"$f":"INDEX(lingue!B179:E179,1,$A$1)","v":"set of gasket valve block HL"},null,null,null,null,0,18,0,"S.GUA.DIS/HL"]
[{"$f":"INDEX(lingue!B180:E180,1,$A$1)","v":"set of gasket valve block 15-250 l/m"},null,null,null,null,0,22,0,"S.GUA.DIS/250"]
[{"$f":"INDEX(lingue!B181:E181,1,$A$1)","v":"set of gasket valve block 300-650 l/m"},null,null,null,null,0,28,0,"S.GUA.DIS/650"]
["imballo",null,null,null,null,null,null,{"$f":"'calcoli vari'!B76","v":0},{"$f":"DATOS!D56","v":"standard: with thermoplastic foil"}]
["motore speciale",null,null,null,null,null,null,{"$f":"'calcoli vari'!B48","v":0}]
[]
[{"$f":"INDEX(lingue!B184:E184,1,$A$1)","v":"Power Unit discount"},null,null,null,null,null,null,{"$f":"C2","v":0}]
[{"$f":"INDEX(lingue!B185:E185,1,$A$1)","v":"Price list"},null,null,null,null,null,null,{"$f":"IF(C16=0,0,SUM(H18:H45))","v":{"$error":"#N/A"}}]
[{"$f":"INDEX(lingue!B186:E186,1,$A$1)","v":"Net price"},null,null,null,null,null,null,{"$f":"H48*(100-H47)/100","v":{"$error":"#N/A"}}]
[{"$f":"INDEX(lingue!B187:E187,1,$A$1)","v":"Quantity Accessories"},null,1]
[{"$f":"INDEX(lingue!B188:E188,1,$A$1)","v":"Discount Accessories"},null,null,null,null,null,null,{"$f":"C2","v":0}]
[{"$f":"INDEX(lingue!B189:E189,1,$A$1)","v":"Price list"},null,null,null,null,null,null,{"$f":"'accessori vari'!E75","v":0}]
[{"$f":"INDEX(lingue!B190:E190,1,$A$1)","v":"Net price"},null,null,null,null,null,null,{"$f":"'accessori vari'!E76","v":0}]
[{"$f":"INDEX(lingue!B191:E191,1,$A$1)","v":"Other items"},null,1,null,null,"Qt","prezzo"]
[{"$f":"INDEX(lingue!B146:E146,1,$A$1)","v":"guided ram"},null,null,null,null,{"$f":"IF(AND(DATOS!D19=2,DATOS!D6<>3),DATOS!D13,0)","v":0},740,{"$f":"G55*F55*$C$54","v":0}]
[{"$f":"INDEX(lingue!B193:E193,1,$A$1)","v":"xxx"},null,null,null,null,0,0,{"$f":"G56*F56*$C$54","v":0}]
["xxx",null,null,null,null,0,0,{"$f":"G57*F57*$C$54","v":0}]
[{"$f":"INDEX(lingue!B90:E90,1,'accessori vari'!$A$1)","v":"riduzione valvola di blocco 1\"1/2-1\"1/4 lato tubo"},null,null,null,null,{"$f":"IF(AND(OR(DATOS!D45=180,DATOS!D45=210),'accessori vari'!A34=1),1,0)","v":0},15,{"$f":"+G58*F58","v":0}]
["raccordo tra valvola di blocco 1\" e tubo 3/4\"",null,null,null,null,{"$f":"IF(AND('accessori vari'!A30+'accessori vari'!A31>0,C20=\"1\"\"\"),1,0)","v":0},5,{"$f":"+G59*F59","v":0}]
[{"$f":"INDEX(lingue!B194:E194,1,$A$1)","v":"xxx"},null,null,null,null,0,0,{"$f":"G60*F60*$C$54","v":0}]
[{"$f":"INDEX(lingue!B196:E196,1,$A$1)","v":"Total"},null,null,null,null,null,null,{"$f":"SUM(H54:H60)*C54","v":0}]
["KMI",null,null,null,null,null,null,{"$f":"'calcoli vari'!B8","v":0}]
["HM-SV - HSV",null,null,null,null,null,null,{"$f":"'calcoli vari'!B113","v":0}]
[{"$f":"INDEX(lingue!B197:E197,1,$A$1)","v":"Net Pirce"},null,null,null,null,null,null,{"$f":"SUM(H61:H63)","v":0}]
[{"$f":"INDEX(lingue!B198:E198,1,$A$1)","v":"price list"},null,null,null,null,null,null,{"$f":"+H14+H48+H52+H64","v":{"$error":"#N/A"}}]
[{"$f":"INDEX(lingue!B199:E199,1,$A$1)","v":"Total NET Price"},null,null,null,null,null,null,{"$f":"+H15+H49+H53+H64","v":{"$error":"#N/A"}}]
[{"$f":"INDEX(lingue!B200:E200,1,$A$1)","v":"extra discount"},null,null,null,null,null,null,0]
[{"$f":"INDEX(lingue!B201:E201,1,$A$1)","v":"Final price"},null,null,null,null,null,null,{"$f":"IF(OR(DATOS!F7=\"Errore\",DATOS!F21=\"Errore\",DATOS!F37=\"Errore\",DATOS!F39=\"Errore\",DATOS!F40=\"Errore\",DATOS!F57=\"Errore\",DATOS!F137=\"errore\"),\"Errore\",INT(H66-H66*H67/100+0.5))","v":{"$error":"#N/A"}}]
[{"$f":"INDEX(lingue!B202:E202,1,$A$1)","v":"Currency"},"1 estero = EUR",null,"??",null,null,null,{"$f":"IF(D69=0,\"//\",H68/D69)","v":{"$error":"#N/A"}}]
[null,null,"tipo","lunghezza cad","prezzo/um","qt",null,"tot"]
["colonna guide",null,"aa",11,100.54541999999999,0,null,{"$f":"+E71*D71*F71","v":0}]
["kit piastre e bulloni",null,null,null,100.245749,0,null,{"$f":"+E72*F72","v":0}]
["bride",null,"Tx",null,100,0,null,{"$f":"+E73*F73","v":0}]
[]
[null,null,null,null,null,"totale impianto",null,{"$f":"H68+SUM(H71:H73)","v":{"$error":"#N/A"}}]

{"sheet":"EN 81.50","index":12,"n_rows":120,"n_cols":9,"rows_kept":120,"cut":false,"hidden":false,"merged":[[95,1,95,6],[36,1,36,6],[37,1,37,6],[38,1,38,6],[3,2,3,5],[4,2,4,5]]}
[null,{"$f":"INDEX(lingue!B362:E362,1,DATOS!$B$5)","v":"CÁLCULO DEL PISTÓN"}]
[null,{"$f":"INDEX(lingue!B363:E363,1,DATOS!$B$5)","v":"CONFORME EN 81-50:2014"}]
[]
[null,{"$f":"INDEX(lingue!B292:E292,1,DATOS!$B$5)","v":"Cliente"},"INAUXA"]
[null,{"$f":"INDEX(lingue!B293:E293,1,DATOS!$B$5)","v":"Referncia Instalación:"},170221]
[]
[null,{"$f":"INDEX(lingue!B294:E294,1,DATOS!$B$5)","v":"DATOS DE LA INSTALACION"}]
[]
[null,{"$f":"INDEX(lingue!B295:E295,1,DATOS!$B$5)","v":"  Suspensión 1 (1:1) 2 (2:1)                                                                                 "},"cm =",{"$f":"DATOS!D8","v":"2"}]
[null,{"$f":"INDEX(lingue!B296:E296,1,DATOS!$B$5)","v":"  Carga nominal                                                                                                   "},"Q =",{"$f":"DATOS!D9","v":300},"Kg"]
[null,{"$f":"INDEX(lingue!B297:E297,1,DATOS!$B$5)","v":"  Peso de la cabina y chasis"},"P3 =",{"$f":"DATOS!D10","v":450},"Kg"]
[null,{"$f":"INDEX(lingue!B298:E298,1,DATOS!$B$5)","v":"  Peso de los cables lado cabina"},"Pf =",{"$f":"DATOS!D11","v":0},"Kg"]
[null,{"$f":"INDEX(lingue!B299:E299,1,DATOS!$B$5)","v":"  Peso de la polea"},"Prh =",{"$f":"DATOS!D12","v":0},"Kg"]
[null,{"$f":"INDEX(lingue!B300:E300,1,DATOS!$B$5)","v":"  Número de pistones."},"Nr =",{"$f":"DATOS!D13","v":1}]
[null,{"$f":"INDEX(lingue!B301:E301,1,DATOS!$B$5)","v":"  Pistón dividido en 1,2,3 piezas"},"n =",{"$f":"DATOS!D14","v":1}]
[null,{"$f":"INDEX(lingue!B302:E302,1,DATOS!$B$5)","v":"  Pistón guiado (no = 1; si = 2)"},"gds=",{"$f":"DATOS!D19","v":1}]
[null,{"$f":"INDEX(lingue!B303:E303,1,DATOS!$B$5)","v":"  Recorrido  total del pistón                 "},"Lp =",{"$f":"IF(D16=1,DATOS!D21/10,DATOS!D21/10+13)","v":155},"cm"]
[null,{"$f":"INDEX(lingue!B304:E304,1,DATOS!$B$5)","v":"  Distancia entre eje de polea y cabeza del vastago"},"L1 =",{"$f":"DATOS!D20/10","v":11.5},"cm"]
[null,{"$f":"INDEX(lingue!B305:E305,1,DATOS!$B$5)","v":"  Longitud libre de inflexión (Lp/gds+L1+g)                "},"L =",{"$f":"(D17/D16+D18)+INDEX(database1!C83:Q83,1,C107)*0.1","v":171.1},"cm"]
[null,{"$f":"INDEX(lingue!B306:E306,1,DATOS!$B$5)","v":"  Peso de la unión                      "},"Pgs =",{"$f":"IF(D15=1,0,INDEX(database1!D32:R37,C108,C109))","v":0},"Kg"]
[null,{"$f":"INDEX(lingue!B307:E307,1,DATOS!$B$5)","v":"  Peso del vastago por metro                           "},"q =",{"$f":"INDEX(database1!D26:R31,C108,C109)","v":7.9},"Kg /m"]
[null,{"$f":"INDEX(lingue!B308:E308,1,DATOS!$B$5)","v":"  Peso total del vastgago (Lp*q)/100+Pgs*(n-1)         "},"Pr =",{"$f":"(D17*D21)/100+D20*(D15-1)","v":12.244999999999999},"Kg"]
[]
[null,{"$f":"INDEX(lingue!B309:E309,1,DATOS!$B$5)","v":" Carga total sobre el pistón"}]
[null,{"$f":"INDEX(lingue!B310:E310,1,DATOS!$B$5)","v":"    a plena carga     T=gn/10*[cm*(Q+P3)/Nr+Pf+Prh]     "},"T =",{"$f":"D30/10*(D9*(D10+D11)/D14+D12+D13)","v":1471.5000000000002},"daN"]
[null,{"$f":"INDEX(lingue!B311:E311,1,DATOS!$B$5)","v":"    a cabina vacia   Tv=gn/10*[cm*(P3)/Nr+Pf+Prh]      "},"Tv =",{"$f":"D30/10*(D9*D11/D14+D12+D13)","v":882.90000000000009},"daN"]
[]
[null,{"$f":"INDEX(lingue!B312:E312,1,DATOS!$B$5)","v":"  Altura piezométrica                              "},"H =",{"$f":"D17/100","v":1.55},"m"]
[null,{"$f":"INDEX(lingue!B313:E313,1,DATOS!$B$5)","v":"  Peso específico del fluido hidraulico"},"y =",0.89,"daN /dm^3",null,null,{"$f":"+(D29*D28)*10000","v":13795.000000000002},"Pa"]
[null,{"$f":"INDEX(lingue!B314:E314,1,DATOS!$B$5)","v":"  Acceleración de la gravedad              "},"gn =",9.81,"m/s^2",null,null,{"$f":"+H29/100000","v":0.13795000000000002},"bar"]
[null,"   pi                                                   ","pi =",3.1415926535897931]
[null,{"$f":"INDEX(lingue!B315:E315,1,DATOS!$B$5)","v":"  Pres. stat. a plena carga (T+Pr*gn/10)/A+(y*H/10) "},"pstat =",{"$f":"(D25+D22*D30/10)/D53+(D29*D28/10)","v":38.686247607281501},"bar"]
[null,{"$f":"INDEX(lingue!B316:E316,1,DATOS!$B$5)","v":"  Pres. stat. en vacio          (Tv+Pr*gn/10)/A+(y*H/10)   "},"pv =",{"$f":"(D26+D22*D30/10)/D53+(D29*D28/10)","v":23.39178238215667},"bar"]
[null,{"$f":"INDEX(lingue!B317:E317,1,DATOS!$B$5)","v":"  Tarado de la válvula de sobrepresión =< pstat*1.4     "},"ps =",{"$f":"D32*1.4","v":54.160746650194099},"bar"]
[]
[null,{"$f":"INDEX(lingue!B318:E318,1,DATOS!$B$5)","v":"PISTÓN"}]
[null,{"$f":"INDEX(lingue!B319:E319,1,DATOS!$B$5)","v":"1- El sistema de unión entre los elementos del pistón y del cilindro, cuando se fabrica en varias piezas, asegura una resistencia no inferior a la de un pistón de iguales dimensiones construido en una sola pieza"},{"$f":"INDEX(lingue!C319:F319,1,DATOS!$B$5)","v":0},{"$f":"INDEX(lingue!D319:G319,1,DATOS!$B$5)","v":0},{"$f":"INDEX(lingue!E319:H319,1,DATOS!$B$5)","v":0},{"$f":"INDEX(lingue!F319:I319,1,DATOS!$B$5)","v":0},{"$f":"INDEX(lingue!G319:J319,1,DATOS!$B$5)","v":0}]
[null,{"$f":"INDEX(lingue!B320:E320,1,DATOS!$B$5)","v":"2- El límite superior del recorrido del pistón es determinado por el tope del fondo sobre la cabeza del cilindro (tope amortiguado)."},{"$f":"INDEX(lingue!C320:F320,1,DATOS!$B$5)","v":0},{"$f":"INDEX(lingue!D320:G320,1,DATOS!$B$5)","v":0},{"$f":"INDEX(lingue!E320:H320,1,DATOS!$B$5)","v":0},{"$f":"INDEX(lingue!F320:I320,1,DATOS!$B$5)","v":0},{"$f":"INDEX(lingue!G320:J320,1,DATOS!$B$5)","v":0}]
[null,{"$f":"INDEX(lingue!B321:E321,1,DATOS!$B$5)","v":"3- Con la cabina apoyada en la parte inferior, sobre los amortiguadores comprimidos totalmente, el pistón no toca el fondo del cilindro"},{"$f":"INDEX(lingue!C321:F321,1,DATOS!$B$5)","v":0},{"$f":"INDEX(lingue!D321:G321,1,DATOS!$B$5)","v":0},{"$f":"INDEX(lingue!E321:H321,1,DATOS!$B$5)","v":0},{"$f":"INDEX(lingue!F321:I321,1,DATOS!$B$5)","v":0},{"$f":"INDEX(lingue!G321:J321,1,DATOS!$B$5)","v":0}]
[]
[null,{"$f":"INDEX(lingue!B322:E322,1,DATOS!$B$5)","v":"MATERIAL"}]
[]
[null,{"$f":"INDEX(lingue!B323:E323,1,DATOS!$B$5)","v":"  Modulo de elasticidad                    "},"E =",2100000,"daN /cm^2"]
[null,{"$f":"INDEX(lingue!B324:E324,1,DATOS!$B$5)","v":"  Material:  St  52,0 (NBK)  DIN 1629 / DIN 2391"}]
[null,{"$f":"INDEX(lingue!B325:E325,1,DATOS!$B$5)","v":"  Limite convenzional de elasticidad                "},"Rp0,2 =",355,"N /mm^2"]
[null,{"$f":"INDEX(lingue!B326:E326,1,DATOS!$B$5)","v":"  Resistencia a la tracción del material"},"Rm =",500,"N /mm^2"]
[]
[null,{"$f":"INDEX(lingue!B327:E327,1,DATOS!$B$5)","v":"DATOS DEL PISTON"}]
[null,{"$f":"INDEX(lingue!B328:E328,1,DATOS!$B$5)","v":"  Diametro externo de la varilla          "},"d =",{"$f":"DATOS!D24","v":70},"mm"]
[null,{"$f":"INDEX(lingue!B329:E329,1,DATOS!$B$5)","v":"  Diametro interno de la varilla"},"di =",{"$f":"IF(D51=0,0,D49-2*D51)","v":60},"mm"]
[null,{"$f":"INDEX(lingue!B330:E330,1,DATOS!$B$5)","v":"Espesor de la varilla                                  "},"es =",{"$f":"DATOS!D25","v":5},"mm"]
[null,{"$f":"INDEX(lingue!B331:E331,1,DATOS!$B$5)","v":"  Momento de inercia          pi/640000*(d^4-di^4)      "},"J =",{"$f":"D31/640000*(D49^4-D50^4)","v":54.241560659636271},"cm^4"]
[null,{"$f":"INDEX(lingue!B332:E332,1,DATOS!$B$5)","v":"  Area del la varilla                pi/400*d^2                "},"A =",{"$f":"D31/400*D49^2","v":38.48451000647497},"cm^2"]
[null,{"$f":"INDEX(lingue!B333:E333,1,DATOS!$B$5)","v":"  Sección resistente           pi/400*(d^2-di^2)         "},"F =",{"$f":"D31/400*(D49^2-D50^2)","v":10.210176124166829},"cm^2"]
[null,{"$f":"INDEX(lingue!B334:E334,1,DATOS!$B$5)","v":"  Radio de inercia           (J/F)^1/2                 "},"i =",{"$f":"SQRT(D52/D54)","v":2.3048861143232218},"cm"]
[null,{"$f":"INDEX(lingue!B335:E335,1,DATOS!$B$5)","v":"VERIFICACIÓN DE  LA CARGA EN PUNTA"}]
[null,{"$f":"INDEX(lingue!B336:E336,1,DATOS!$B$5)","v":"  Grado de esbeltez           L/i                  "},"lambda",{"$f":"D19/D55","v":74.23360266554414},null,{"$f":"IF(D57>=100,\">\",\"<\")","v":"<"},100]
[null,{"$f":"INDEX(lingue!B337:E337,1,DATOS!$B$5)","v":"Carga en punta efectiva"}]
[null,"  F5=1.4*gn/10*[cm*(Q+P3)/Nr+0,64*Pr+Pf+Prh]            ","F5 =",{"$f":"(1.4*D30/10*(D9*(D10+D11)/D14+0.64*D22+D12+D13))","v":2070.8630611200001},"daN"]
[null,{"$f":"INDEX(lingue!B338:E338,1,DATOS!$B$5)","v":"Carga máxima admisible"}]
[null,{"$f":"IF(D57>100,\" F5am=pi^2*E*J/(2*L^2)\",\" F5am=F/2[Rm-(Rm-210)*(lambda/100)^2]\")","v":" F5am=F/2[Rm-(Rm-210)*(lambda/100)^2]"},"F5am",{"$f":"IF(D57>100,D31^2*D43*D52/(2*D19^2),(D54*10/2)*(D46-(D46-210)*(D57/100)^2))","v":17367.090705723305},"daN"]
[]
[null,{"$f":"INDEX(lingue!B339:E339,1,DATOS!$B$5)","v":"COEFICIENTE DE SEGURIDAD"},null,{"$f":"(D61*2)/D59","v":16.772804568092045}]
[]
[null,{"$f":"INDEX(lingue!B340:E340,1,DATOS!$B$5)","v":"VERIFICACIÓN DE  RESISTENCIA DE LA PARED A PRESION RADIAL"}]
[null,"  gs=20*Rp0,2*(es-0,5)/(2,3*pstat*d) => 1,7             ","gs =",{"$f":"IF(D51=0,\"MACIZO\",20*D45*(D51-0.5)/(2.3*D32*D49))","v":5.1296576236458895},null,">",1.7]
[null,{"$f":"INDEX(lingue!B341:E341,1,DATOS!$B$5)","v":"CILINDRO"}]
[null,{"$f":"INDEX(lingue!B342:E342,1,DATOS!$B$5)","v":"  Material:  St  52,0 (NBK)  DIN 1629 / DIN 2448"}]
[null,{"$f":"INDEX(lingue!B343:E343,1,DATOS!$B$5)","v":"  Limite convenzional de elasticidad          "},"Rp0,2 =",355,"N /mm^2"]
[null,{"$f":"INDEX(lingue!B344:E344,1,DATOS!$B$5)","v":"DATO DEL CILINDRO"}]
[null,{"$f":"INDEX(lingue!B345:E345,1,DATOS!$B$5)","v":"  Modelo Piston"},null,{"$f":"DATOS!D7","v":9130}]
[null,{"$f":"INDEX(lingue!B346:E346,1,DATOS!$B$5)","v":"  Diametro externo del cilindro                          "},"D =",{"$f":"IF(OR(DATOS!D7=\"MCS\",DATOS!D7=\"MCE\"),INDEX(database1!C92:Q99,2,'EN 81.50'!C107),IF(DATOS!D7=\"CRA\",INDEX(database1!C109:Q116,2,'EN 81.50'!C107),INDEX(database1!C73:Q80,2,'EN 81.50'!C107)))","v":114.3},"mm"]
[null,{"$f":"INDEX(lingue!B347:E347,1,DATOS!$B$5)","v":"  Diametro interno del cilindro                        "},"Di =",{"$f":"D72-2*D74","v":106.3},"mm"]
[null,{"$f":"INDEX(lingue!B348:E348,1,DATOS!$B$5)","v":"  Espesor del cilindro                        "},"ecy1 =",{"$f":"IF(OR(DATOS!D7=\"MCS\",DATOS!D7=\"MCE\"),INDEX(database1!C92:Q99,1,'EN 81.50'!C107),IF(DATOS!D7=\"CRA\",INDEX(database1!C109:Q116,1,'EN 81.50'!C107),INDEX(database1!C73:Q80,1,'EN 81.50'!C107)))","v":4},"mm"]
[null,{"$f":"INDEX(lingue!B349:E349,1,DATOS!$B$5)","v":"VERIFICACIÓN PRESIÓN INTERNA DEL CILINDRO"}]
[null,"  gc=20*Rp0,2*(ecy1-1)/2,3*pstat*Di) => 1,7              ","gc =",{"$f":"20*D45*(D74-1)/(2.3*D32*D73)","v":2.2519663446548281},null,">",1.7]
[null,{"$f":"INDEX(lingue!B350:E350,1,DATOS!$B$5)","v":"VERIFICACIÓN A PRESIÓN INTERNA DEL FONDO DEL CILINDRO (CON RANURA DE DESAHOGO)"}]
[null,{"$f":"INDEX(lingue!B351:E351,1,DATOS!$B$5)","v":"  Espesor de la pared interna de la ranura       "},"s1 =",{"$f":"INDEX(database1!C73:Q80,6,'EN 81.50'!C107)","v":4.9000000000000004},"mm"]
[null,{"$f":"INDEX(lingue!B352:E352,1,DATOS!$B$5)","v":"  Espesor del fondo                  "},"e1 = h1 =",{"$f":"INDEX(database1!C73:Q80,7,'EN 81.50'!C107)","v":20},"mm"]
[null,"    ge1=10*Rp0,2*(e1-1)^2/(0,16*2,3*pstat*Di^2)       ","ge1 =",{"$f":"10*D45*(D79-1)^2/(0.16*2.3*D32*D73^2)","v":7.9664456963428263},"mm",">","1,7"]
[null,"    h1 >= u1 + r1                                       ","h1 =",{"$f":"D79","v":20},"mm",">",{"$f":"D85+D82","v":11.2}]
[null,{"$f":"INDEX(lingue!B353:E353,1,DATOS!$B$5)","v":"  Radio de la ranura de desahogo                         "},"r1 =",{"$f":"INDEX(database1!C73:Q80,5,'EN 81.50'!C107)","v":5},"mm"]
[null,"    r1 >= 5                                             ","r1 =",{"$f":"D82","v":5},"mm"]
[null,"    r1 >= 0,2*s1                                        ","r1 =",{"$f":"D82","v":5},"mm",">",{"$f":"0.2*D78","v":0.98000000000000009}]
[null,{"$f":"INDEX(lingue!B354:E354,1,DATOS!$B$5)","v":"  Espesor del fondo de la ranura de desahogo        "},"u1 =",{"$f":"INDEX(database1!C73:Q80,8,'EN 81.50'!C107)","v":6.2},"mm"]
[null,"    gu1=10*Rp0,2*(u1-1)/[1,3*2,3*pstat*(D1/2-r1)]    ","gu1 =",{"$f":"10*D69*(D85-1)/(1.3*2.3*D32*(D73/2-D82))","v":3.3144205252586807},"mm",">",1.7]
[null,"    u1 =< 1,5*s1                                       ","u1 =",{"$f":"D85","v":6.2},"mm","<",{"$f":"1.5*D78","v":7.3500000000000005}]
[null,{"$f":"INDEX(lingue!B355:E355,1,DATOS!$B$5)","v":"CONDUCCIÓN DE CONEXIÓN ENTRE LA CENTRAL Y LA VÁLVULA PARACAÍDAS"}]
[null,{"$f":"INDEX(lingue!B356:E356,1,DATOS!$B$5)","v":"  Material: St 37,0  (GBK) DIN 1629 / DIN 2391"}]
[null,{"$f":"INDEX(lingue!B357:E357,1,DATOS!$B$5)","v":"  Limite convencional de elasticidad          "},"Rp0,2 =",235,"N /mm^2"]
[null,{"$f":"INDEX(lingue!B358:E358,1,DATOS!$B$5)","v":"  Diámetro externo de la conducción         "},"Dt =",35,"mm "]
[null,{"$f":"INDEX(lingue!B359:E359,1,DATOS!$B$5)","v":"  Espesor de la conducción                                 "},"et =",2.5,"mm"]
[null,{"$f":"INDEX(lingue!B360:E360,1,DATOS!$B$5)","v":"VERIFICACIÓN DE LA PRESIÓN INTERNA"}]
[null,"  gt=20*Rp0,2*(et-0,5)/(2,3*pstat*Dt)      >= 1,7","gt =",{"$f":"20*D90*(D92-0.5)/(2.3*D32*D91)","v":3.0183900884050932},null,">",1.7]
[]
[null,{"$f":"INDEX(lingue!B361:E361,1,DATOS!$B$5)","v":"Las válvulas y todas las conexión están calculadas y construidas de modo que, bajo los esfuerzos derivados de una persión 2,3 veces la presion estática máxima, está garantizado un coeficiente de seguridad de 1,7 respecto al límite convencional de Rp0,2"},{"$f":"INDEX(lingue!C363:F363,1,DATOS!$B$5)","v":0},{"$f":"INDEX(lingue!D363:G363,1,DATOS!$B$5)","v":0},{"$f":"INDEX(lingue!E363:H363,1,DATOS!$B$5)","v":0},{"$f":"INDEX(lingue!F363:I363,1,DATOS!$B$5)","v":0},{"$f":"INDEX(lingue!G363:J363,1,DATOS!$B$5)","v":0}]
[]
[]
[]
[]
[]
[null,{"$f":"INDEX(lingue!B364:E364,1,DATOS!$B$5)","v":"SELLO Y FIRMA __________________________________"},null,{"$f":"TODAY()","v":"2023-11-30"}]
[]
[]
[]
[]
[null,"PARAMETRO 1",{"$f":"MATCH(D49,database1!C72:Q72,0)","v":4}]
[null,"PARAMETRO 2 ",{"$f":"MATCH(D51,database1!C26:C31,0)","v":2}]
[null,"PARAMETRO 3",{"$f":"MATCH(D49,database1!D7:R7,0)","v":4}]
[]
[]
[]
[]
[null,"massa giunta pistone",{"$f":"IF(D49<=60,0,INDEX(database1!D62:R67,C108,C109)*(D15-1))","v":0},"por piston"]
[null,"masa piston 9130",{"$f":"INDEX(database1!D38:R43,C108,C109)+(D17/100-3)*INDEX(database1!D56:R61,C108,C109)","v":46},"por piston","masa primer tramo 3 metros + massa del la  diferencia (incluso negativa)"]
[null,"masa piston 9140",{"$f":"INDEX(database1!D44:R49,C108,C109)+(D17/100-3)*INDEX(database1!D56:R61,C108,C109)","v":50},"por piston"]
[null,"masa piston 9150",{"$f":"INDEX(database1!D50:R55,C108,C109)+(D17/100-3)*INDEX(database1!D56:R61,C108,C109)","v":84},"por piston"]
[]
[]
[null,"peso totale pistón",{"$f":"(IF('accessori centralina'!B5=9130,'EN 81.50'!C115,IF('accessori centralina'!B5=9140,'EN 81.50'!C116,'EN 81.50'!C117))+'EN 81.50'!C114)*D14","v":46}]

{"sheet":"EN 81.50 (T)","index":13,"n_rows":97,"n_cols":21,"rows_kept":97,"cut":false,"hidden":false,"merged":[[3,1,3,4],[4,1,4,4]]}
["CÁLCULO DEL PISTÓN TELESCOPICO"]
["CONFORME EN 81-50:2014"]
["REV4"]
["Cliente"]
["Referncia Instalación:",null,null,null,null,null,null,null,null,null,null,null,null,null,null,null,null,null,"36/60","60/80"]
[null,null,null,null,null,null,null,null,null,null,null,null,null,null,null,null,null,"Modelos",1,2]
["DATOS DE LA INSTALACION",null,null,null,null,null,null,null,null,null,"Densidad acero",7.85,"gr/cm3",null,null,null,null,"36/60",80,110]
[null,null,null,null,null,null,null,null,null,null,null,null,null,null,null,null,null,"60/80",5,5]
["  Suspensión 1 (1:1)                                                                           ","cm =",{"$f":"DATOS!D8","v":"2"},null,null,null,null,null,null,null,"vástago 1",{"$f":"INDEX(S21:T21,1,$E$32)","v":{"$error":"#VALUE!"}},null,"vástago 2",{"$f":"INDEX(S22:T22,1,$E$32)","v":{"$error":"#VALUE!"}},null,null,null,60,80]
["  Carga nominal                                                                                                   ","Q =",{"$f":"DATOS!D9","v":300},"Kg",null,null,null,null,null,"Peso/m",{"$f":"INDEX(S21:T21,1,$E$32)","v":{"$error":"#VALUE!"}},{"$f":"C51*$L$7/1000","v":{"$error":"#VALUE!"}},"kg/cm",{"$f":"INDEX(S22:T22,1,$E$32)","v":{"$error":"#VALUE!"}},{"$f":"C65*L7/1000","v":{"$error":"#VALUE!"}},"kg/cm",null,null,5,5]
["  Peso de la cabina y chasis","P =",{"$f":"DATOS!D10","v":450},"Kg",null,null,null,null,null,null,"Cierre antiretorno",0.32,"kg","Cabeza vástago",1.36,"kg",null,null,36,60]
["  Número de pistones.","Nr =",{"$f":"DATOS!D13","v":1},null,null,null,null,null,null,null,"Varilla percutora",0.12,"kg","Varilla percutora",0.12,"kg",null,null,0,5]
["  Recorrido  total del pistón                 ","Lp =",{"$f":"DATOS!D21/10","v":155},"cm",null,null,null,null,null,null,"Cabeza camisa",2.0099999999999998,"kg","fondo vástago",0.11,"kg",null,"Cota para Lt",43,49.5]
["  Longitud de piston cerrado","Lt",{"$f":"C13/2+INDEX(S13:T13,1,$E$32)","v":{"$error":"#VALUE!"}},"cm",null,null,null,"LT=Lp/2+CotaLt",null,null,"antirretorno",2.02,"kg","Pele2",{"$f":"SUM(O11:O13)","v":1.59},"kg",null,"Lt",{"$f":"$C$13/2+S13","v":120.5},{"$f":"$C$13/2+T13","v":127},"cm"]
[null,null,null,null,null,null,null,null,null,null,"Pele1",{"$f":"SUM(L11:L14)","v":4.47},"kg",null,null,null,null,"Lc",{"$f":"S14-33","v":87.5},{"$f":"T14-39.2","v":87.8}]
[" Carga total sobre el pistón",null,null,null,null,null,null,null,null,null,null,null,null,null,null,null,60,"Lv1",{"$f":"S14-25","v":95.5},{"$f":"T14-31","v":96}]
["    a plena carga     T=gn/10*[cm*(Q+P)/Nr]     ","T =",{"$f":"C22/10*(C9*(C10+C11)/C12)","v":1471.5000000000002},"daN",null,null,null,null,null,null,null,null,null,null,null,null,36,"Lv2",{"$f":"S14-21.2","v":99.3},{"$f":"T14-19","v":108}]
["    a cabina vacia   Tv=gn/10*[cm*(P)/Nr]      ","Tv =",{"$f":"C22/10*(C9*C11/C12)","v":882.90000000000009},"daN"]
[null,null,null,null,null,null,null,null,null,null,"Calculo de velocidades"]
["  Altura piezométrica                              ","H =",{"$f":"C13/100","v":1.55},"m",null,null,null,null,null,null,"Bomba",{"$f":"DATOS!D45","v":55},"l/min"]
["  Peso específico del fluido hidráulico","y =",0.89,"daN /dm^3",null,null,{"$f":"+(C21*C20)*10000","v":13795.000000000002},"Pa",null,null,"Hz",{"$f":"DATOS!D47","v":50},"Hz",null,null,null,null,null,"VASTAGO 60/5","VASTAGO 80/5"]
["  Aceleración de la gravedad              ","gn =",9.81,"m/s^2",null,null,{"$f":"+G21/100000","v":0.13795000000000002},"bar",null,null,"Factor",2,null,null,null,null,null,null,"VASTAGO 36/0","VASTAGO 60/5"]
["  pi                                                   ","pi =",{"$f":"PI()","v":3.1415926535897931},null,null,null,null,null,2,null,"Velocidad",{"$f":"IF(L21=50,L22*L20/6/C37,1.2*L22*L20/6/C37)","v":{"$error":"#VALUE!"}},"m/s",null,null,null,null,null,"36/60","60/80"]
[]
["MATERIAL"]
[]
["  Modulo de elasticidad                    ","E =",2100000,"daN /cm^2"]
["  Material:  St  52,0 (NBK)  DIN 1629 / DIN 2391"]
["  Limite convencional de elasticidad                ","Rp0,2 =",355,"N /mm^2"]
["  Resistencia a la tracción del material","Rm =",500,"N /mm^2"]
["  ",null,null,null,null,null,null,null,3]
["DATOS DEL PISTON","modelo",{"$f":"IF(DATOS!K2=16,\"36/60\",IF(DATOS!K2=17,\"60/80\",\"ERROR\"))","v":"ERROR"},null,{"$f":"DATOS!K2-15","v":-11}]
["Datos del cilindro"]
["  Diámetro externo del cilindro                          ","D =",{"$f":"INDEX(S7:T7,1,$E$32)","v":{"$error":"#VALUE!"}},"mm"]
["  Diámetro interno del cilindro                        ","Di =",{"$f":"C34-2*C36","v":{"$error":"#VALUE!"}},"mm"]
["  Espesor del cilindro                        ","ecy1 =",{"$f":"INDEX(S8:T8,1,$E$32)","v":{"$error":"#VALUE!"}},"mm"]
["  Area interior del cilindro pi/400*Di^2          ","A=",{"$f":"C23/400*C35^2","v":{"$error":"#VALUE!"}},"cm^2"]
["  Area de trasmisión (A-F1)","At=",{"$f":"C37-C51","v":{"$error":"#VALUE!"}},"cm^2"]
["  Presión stat.a plena carga cilindro ((pstat1*At+Pr1)*gn/10)/A","pstat =",{"$f":"(C54*C38+(C48*C22/10))/C37","v":{"$error":"#VALUE!"}},"bar"]
["  Presión stat. en vacío ((pv1*At+Pr1)*gn/10)/A","pv =",{"$f":"(C55*C38+(C48*C22)/10)/C37","v":{"$error":"#VALUE!"}},"bar",null,null,null,"Relación sincronismo Di^2-D1^2",null,{"$f":"(C35^2-C43^2)/100","v":{"$error":"#VALUE!"}},"cm^2"]
["  Tarado de la válvula de sobrepresión =< pstat*1.4     ","ps =",{"$f":"C39*1.4","v":{"$error":"#VALUE!"}},"bar",null,null,null,"Relación sincronismo d2^2",null,{"$f":"C57^2/100","v":{"$error":"#VALUE!"}},"cm^2"]
["1º Sección",null,null,null,null,null,null,null,null,{"$f":"J41/J40","v":{"$error":"#VALUE!"}}]
["  Diámetro externo de la varilla 1º sección         ","d1 =",{"$f":"INDEX(S9:T9,1,$E$32)","v":{"$error":"#VALUE!"}},"mm"]
["  Diámetro interno de la varilla 1sección","di1 =",{"$f":"C43-2*C45","v":{"$error":"#VALUE!"}},"mm",null,null,null,null,"caudal",{"$f":"IF(DATOS!D47=60,DATOS!D45*1.2,DATOS!D45)","v":55},"l/min"]
["  Espesor de la varilla                                  ","es1 =",{"$f":"INDEX(S10:T10,1,$E$32)","v":{"$error":"#VALUE!"}},"mm",null,null,null,null,"velocidad",{"$f":"J44*((C37-C50)/C37)/C64/3","v":{"$error":"#VALUE!"}},"m/s"]
["  Peso del vástago 1 por metro","q1",{"$f":"L10","v":{"$error":"#VALUE!"}},"kg/cm",null,null,null,null,"potencia",{"$f":"J44*1.4*C39/600/0.8","v":{"$error":"#VALUE!"}},"kw"]
["  Peso de elementos del vástago","Pele1",{"$f":"L15","v":4.47},"kg",null,null,null,null,"aceite en piston",{"$f":"IF(DATOS!K2=16,S16*C50/1000,IF(DATOS!K2=17,T16*C50/1000,))","v":0},"l","El aceite contenido en las camaras sincronismo que es cte"]
["  Peso total vástago q1*Lp/2+Pele1","Pr1",{"$f":"C46*C13/2+C47","v":{"$error":"#VALUE!"}},"kg",null,null,null,null,"aceite en circulacion",{"$f":"IF(DATOS!K2=16,S15*C37/1000,IF(DATOS!K2=17,T15*C37/1000,))","v":0},"l","El aceite en circulacion lo que entra en la camisa"]
["  Momento de inercia          pi/640000*(d1^4-di^4)      ","J1 =",{"$f":"C23/640000*(C43^4-C44^4)","v":{"$error":"#VALUE!"}},"cm^4"]
["  Area del la varilla                pi/400*d1^2                ","A1 =",{"$f":"C23/400*C43^2","v":{"$error":"#VALUE!"}},"cm^2"]
["  Sección resistente           pi/400*(d1^2-di^2)         ","F1 =",{"$f":"C23/400*(C43^2-C44^2)","v":{"$error":"#VALUE!"}},"cm^2"]
["  Radio de inercia           (J/F1)^1/2                 ","i1 =",{"$f":"SQRT(C49/C51)","v":{"$error":"#VALUE!"}},"cm"]
["  Longitud libre de inflexión sección 1","L1=",{"$f":"$C$13/2","v":77.5},"cm"]
["  Presion stat.a plena carga sección1 ((T+Pr2)*gn/10)/A2 ","pstat1=",{"$f":"((C17+(C62*C22/10))/C64)","v":{"$error":"#VALUE!"}},"bar",null,null,null,{"$f":"C54*1.4","v":{"$error":"#VALUE!"}}]
["  Presion stat en vacío sección 1 ((Tv+Pr2)*gn/10)/A2","pv1=",{"$f":"(C18+(C62*C22/10))/C64","v":{"$error":"#VALUE!"}},"bar"]
["2º Sección maciza"]
["  Diámetro externo de la varilla 2º sección         ","d2 =",{"$f":"INDEX(S11:T11,1,$E$32)","v":{"$error":"#VALUE!"}},"mm"]
["  Diámetro interno de la varilla 2º sección","di2 =",{"$f":"IF(C59=0,0,C57-2*C59)","v":{"$error":"#VALUE!"}},"mm"]
["  Espesor de la varilla                                  ","es1 =",{"$f":"INDEX(S12:T12,1,$E$32)","v":{"$error":"#VALUE!"}},"mm"]
["  Peso del vástago 2 por metro","q2=",{"$f":"O10","v":{"$error":"#VALUE!"}},"kg/cm"]
["  Peso de elementos del vástago","Pele2",{"$f":"O14","v":1.59},"kg"]
["  Peso total vástago q2*Lp/2+Pele2","Pr2",{"$f":"C60*C13/2+C61","v":{"$error":"#VALUE!"}},"kg"]
["  Momento de inercia          pi/640000*(d2^4-di2^4)      ","J2",{"$f":"$C$23/640000*(C57^4-C58^4)","v":{"$error":"#VALUE!"}},"cm^4"]
["  Area del la varilla                pi/400*d2^2                ","A2 =",{"$f":"C23/400*C57^2","v":{"$error":"#VALUE!"}},"cm^2"]
["  Sección resistente           pi/400*(d2^2-di2^2)         ","F2 =",{"$f":"$C$23/400*(C57^2-C58^2)","v":{"$error":"#VALUE!"}},"cm^2"]
["  Radio de inercia           (J/F)^1/2                 ","i2 =",{"$f":"SQRT(C63/C65)","v":{"$error":"#VALUE!"}},"cm"]
["  Longitud libre de inflexión sección 2","L2=",{"$f":"$C$13/2","v":77.5},"cm"]
["VERIFICACIÓN DE  LA CARGA EN PUNTA"]
["  Constante Phi 1,25*(J2/J1)^0,5-0,2","phi=",{"$f":"1.25*(C63/C49)^0.5-0.2","v":{"$error":"#VALUE!"}}]
["  Radio de giro equivalente  ie=d1/4*(phi*(1+(di1/d1)^2)^0,5","ie=",{"$f":"0.1*C43/4*(C69*(1+(C44/C43)^2))^0.5","v":{"$error":"#VALUE!"}},"cm"]
[" Coeficiente esbeltez equivalente","lme=",{"$f":"C13/C70","v":{"$error":"#VALUE!"}},null,{"$f":"IF(C71>=100,\">\",\"<\")","v":{"$error":"#VALUE!"}},100]
[" Carga en punta efectiva"]
["  F5=1.4*gn/10*[cm*(Q+P)/Nr+0,64*Pr1+Pr2]            ","F5 =",{"$f":"1.4*$C$22/10*(C10+C11+0.64*C48+C62)","v":{"$error":"#VALUE!"}},"daN",">",null,null,"con guiado"]
[" Carga máxima admisible",null,null,null,null,null,null,"lme>100"]
[{"$f":"IF(C71>100,\" F5am=pi^2*E*J2*phi/(2*L^2)\",\" F5am=F/2[Rm-(Rm-210)*(lambda/100)^2]\")","v":{"$error":"#VALUE!"}},"F5am",{"$f":"IF(C71>100,$C$23^2*$C$27*C49*C69/(2*C13^2),\"ERROR\")","v":{"$error":"#VALUE!"}},"daN","=>'","F5 ",null,"F5am",6585.27,"daN"]
[]
["COEFICIENTE DE SEGURIDAD",null,{"$f":"(C75*2)/C73","v":{"$error":"#VALUE!"}},null,null,null,null,null,10.33406213]
[]
["VERIFICACIÓN DE  RESISTENCIA DE LA PARED A PRESION RADIAL 1º SECCIÓN"]
["  gs=20*Rp0,2*(es-0,5)/(2,3*pstat1*d1) => 1,7             ","gs =",{"$f":"20*$C$29*(C45-0.5)/(2.3*C54*C43)","v":{"$error":"#VALUE!"}},null,">",1.7]
["VERIFICACIÓN PRESIÓN INTERNA DEL CILINDRO"]
["  gc=20*Rp0,2*(ecy1-1)/2,3*pstat1*D) => 1,7              ","gc =",{"$f":"20*$C$29*(C36-1)/(2.3*C54*C34)","v":{"$error":"#VALUE!"}},null,">",1.7]
["VERIFICACIÓN A PRESIÓN INTERNA DEL FONDO DEL CILINDRO (CON FONDO PLANO)"]
["  Espesor del fondo                  ","e3",26,"mm"]
["    ge3=10*Rp0,2*(e3-1)^2/(0,16*2,3*pstat*Di^2)       ","ge1 =",{"$f":"10*$C$29*(C84-1)^2/(0.16*2.3*C39*C35^2)","v":{"$error":"#VALUE!"}},"mm",">","1,7"]
["CONDUCCIÓN DE CONEXIÓN RIGIDA ENTRE LA CENTRAL Y LA VÁLVULA PARACAÍDAS"]
["  Material: St 37,0  (GBK) DIN 1629 / DIN 2391"]
["  Limite convencional de elasticidad          ","Rp0,2 =",235,"N /mm^2"]
["  Diámetro externo de la conducción         ","Dt =",35,"mm "]
["  Espesor de la conducción                                 ","et =",2.5,"mm"]
["VERIFICACIÓN DE LA PRESIÓN INTERNA"]
["  gt=20*Rp0,2*(et-0,5)/(2,3*pstat*Dt)      >= 1,7","gt =",{"$f":"20*C88*(C90-0.5)/(2.3*C39*C89)","v":{"$error":"#VALUE!"}},null,">",1.7]
[]
[]
[]
[]
["SELLO Y FIRMA __________________________________",null,{"$f":"TODAY()","v":"2023-11-30"}]

{"sheet":"EN 81.50 HCR-75","index":14,"n_rows":121,"n_cols":19,"rows_kept":121,"cut":false,"hidden":false,"merged":[[97,1,97,6],[3,2,3,5],[4,2,4,5],[37,1,37,6],[38,1,38,6],[39,1,39,6]]}
[null,{"$f":"INDEX(lingue!B362:E362,1,DATOS!$B$5)","v":"CÁLCULO DEL PISTÓN"}]
[null,{"$f":"INDEX(lingue!B363:E363,1,DATOS!$B$5)","v":"CONFORME EN 81-50:2014"}]
[]
[null,{"$f":"INDEX(lingue!B292:E292,1,DATOS!$B$5)","v":"Cliente"}]
[null,{"$f":"INDEX(lingue!B293:E293,1,DATOS!$B$5)","v":"Referncia Instalación:"}]
[]
[null,{"$f":"INDEX(lingue!B294:E294,1,DATOS!$B$5)","v":"DATOS DE LA INSTALACION"},null,null,null,null,null,null,null,null,"Densidad acero",7850,null,null,null,null,"Recorrido (m)","Carga (kg)","Pmax"]
[null,null,null,null,null,null,null,null,null,null,null,null,null,null,null,null,15,200]
[null,{"$f":"INDEX(lingue!B295:E295,1,DATOS!$B$5)","v":"  Suspensión 1 (1:1) 2 (2:1)                                                                                 "},"cm =",{"$f":"DATOS!D8","v":"2"},null,null,null,null,null,null,"Peso del vastago por metro",{"$f":"D55/10000*L7","v":12.484885554906688},null,null,null,null,13.4,300]
[null,{"$f":"INDEX(lingue!B296:E296,1,DATOS!$B$5)","v":"  Carga nominal                                                                                                   "},"Q =",{"$f":"DATOS!D9","v":300},"Kg",null,null,null,null,null,"Peso tapa cabeza vastago",0.23400000000000001,null,null,null,null,12,400]
[null,{"$f":"INDEX(lingue!B297:E297,1,DATOS!$B$5)","v":"  Peso de la cabina y chasis"},"P3 =",{"$f":"DATOS!D10","v":450},"Kg",null,null,null,null,null,"Peso tapa inferior vastago",1.841,null,null,null,null,11.2,500]
[null,{"$f":"INDEX(lingue!B298:E298,1,DATOS!$B$5)","v":"  Peso de los cables lado cabina"},"Pf =",{"$f":"DATOS!D11","v":0},"Kg",null,null,null,null,null,null,null,null,null,null,null,10.4,600]
[null,{"$f":"INDEX(lingue!B299:E299,1,DATOS!$B$5)","v":"  Peso de la polea"},"Prh =",{"$f":"DATOS!D12","v":0},"Kg",null,null,null,null,null,null,null,null,null,null,null,9.6999999999999993,700]
[null,{"$f":"INDEX(lingue!B300:E300,1,DATOS!$B$5)","v":"  Número de pistones."},"Nr =",{"$f":"DATOS!D13","v":1},null,null,null,null,null,null,null,null,null,null,null,null,9.1999999999999993,800]
[null,{"$f":"INDEX(lingue!B301:E301,1,DATOS!$B$5)","v":"  Pistón dividido en 1,2,3 piezas"},"n =",{"$f":"DATOS!D14","v":1},null,null,null,null,null,null,null,null,null,null,null,null,8.6999999999999993,900]
[null,{"$f":"INDEX(lingue!B302:E302,1,DATOS!$B$5)","v":"  Pistón guiado (no = 1; si = 2)"},"gds=",{"$f":"DATOS!D19","v":1},null,null,null,null,null,null,null,null,null,null,null,null,8.3000000000000007,1000]
[null,{"$f":"INDEX(lingue!B303:E303,1,DATOS!$B$5)","v":"  Recorrido  total del pistón                 "},"Lp =",{"$f":"IF(D16=1,DATOS!D21/10,DATOS!D21/10+13)","v":155},"cm",null,null,null,null,null,null,null,null,null,null,null,7.9,1100]
[null,"  Longitud de piston cerrado","Lt",{"$f":"D17+334","v":489},"cm",null,null,null,null,null,null,null,null,null,null,null,7.6,1200]
[null,{"$f":"INDEX(lingue!B304:E304,1,DATOS!$B$5)","v":"  Distancia entre eje de polea y cabeza del vastago"},"L1 =",{"$f":"DATOS!D20/10","v":11.5},"cm",null,null,null,null,null,null,null,null,null,null,null,7.3,1300]
[null,{"$f":"INDEX(lingue!B305:E305,1,DATOS!$B$5)","v":"  Longitud libre de inflexión (Lp/gds+L1+g)                "},"L =",{"$f":"(D17/D16+D19)+35*0.1","v":170},"cm",null,null,"cota g=35mm",null,null,null,null,null,null,null,null,7.05,1400]
[null,{"$f":"INDEX(lingue!B306:E306,1,DATOS!$B$5)","v":"  Peso de la unión                      "},"Pgs =",{"$f":"IF(D15=1,0,INDEX(database1!E33:R37,C110,C111))","v":0},"Kg",null,null,null,null,null,null,null,null,null,null,null,6.8,1500]
[null,{"$f":"INDEX(lingue!B307:E307,1,DATOS!$B$5)","v":"  Peso del vastago por metro                           "},"q =",{"$f":"L9","v":12.484885554906688},"Kg /m",null,null,null,null,null,null,null,null,null,null,null,6.6,1600]
[null,{"$f":"INDEX(lingue!B308:E308,1,DATOS!$B$5)","v":"  Peso total del vastgago (Lp*q)/100+Pgs*(n-1)         "},"Pr =",{"$f":"(D17*D22)/100+D21*(D15-1)+L10+L11","v":21.426572610105367},"Kg",null,null,null,null,null,null,null,null,null,null,null,6.45,1700]
[null,null,null,null,null,null,null,null,null,null,null,null,null,null,null,null,6.3,1800]
[null,{"$f":"INDEX(lingue!B309:E309,1,DATOS!$B$5)","v":" Carga total sobre el pistón"},null,null,null,null,null,null,null,null,"Volumen de aceite de circulacion",{"$f":"D76/100*10","v":5.026548245743669},"l/m",null,null,null,6.1,1900]
[null,{"$f":"INDEX(lingue!B310:E310,1,DATOS!$B$5)","v":"    a plena carga     T=gn/10*[cm*(Q+P3)/Nr+Pf+Prh]     "},"T =",{"$f":"D31/10*(D9*(D10+D11)/D14+D12+D13)","v":1471.5000000000002},"daN",null,null,null,null,null,null,null,null,null,null,null,5.95,2000]
[null,{"$f":"INDEX(lingue!B311:E311,1,DATOS!$B$5)","v":"    a cabina vacia   Tv=gn/10*[cm*(P3)/Nr+Pf+Prh]      "},"Tv =",{"$f":"D31/10*(D9*D11/D14+D12+D13)","v":882.90000000000009},"daN",null,null,null,null,null,null,null,null,null,null,null,5.8,2100]
[null,null,null,null,null,null,null,null,null,null,null,null,null,null,null,null,5.7,2200]
[null,{"$f":"INDEX(lingue!B312:E312,1,DATOS!$B$5)","v":"  Altura piezométrica                              "},"H =",{"$f":"D17/100","v":1.55},"m",null,null,null,null,null,null,null,null,null,null,null,5.6,2300]
[null,{"$f":"INDEX(lingue!B313:E313,1,DATOS!$B$5)","v":"  Peso específico del fluido hidraulico"},"y =",0.89,"daN /dm^3",null,null,{"$f":"+(D30*D29)*10000","v":13795.000000000002},"Pa",null,null,null,null,null,null,null,5.5,2400]
[null,{"$f":"INDEX(lingue!B314:E314,1,DATOS!$B$5)","v":"  Acceleración de la gravedad              "},"gn =",9.81,"m/s^2",null,null,{"$f":"+H30/100000","v":0.13795000000000002},"bar",null,null,null,null,null,null,null,5.4,2500]
[null,"   pi                                                   ","pi =",3.1415926535897931,null,null,null,null,null,null,null,null,null,null,null,null,5.3,2600]
[null,{"$f":"INDEX(lingue!B315:E315,1,DATOS!$B$5)","v":"  Pres. stat. a plena carga (T+Pr*gn/10)/A+(y*H/10) "},"pstat =",{"$f":"(D26+D23*D31/10)/D54+(D30*D29/10)","v":33.92167991291673},"bar",null,null,null,null,null,null,null,null,null,null,null,5.2,2700]
[null,{"$f":"INDEX(lingue!B316:E316,1,DATOS!$B$5)","v":"  Pres. stat. en vacio          (Tv+Pr*gn/10)/A+(y*H/10)   "},"pv =",{"$f":"(D27+D23*D31/10)/D54+(D30*D29/10)","v":20.59850131680799},"bar",null,null,null,null,null,null,null,null,null,null,null,5.0999999999999996,2800]
[null,{"$f":"INDEX(lingue!B317:E317,1,DATOS!$B$5)","v":"  Tarado de la válvula de sobrepresión =< pstat*1.4     "},"ps =",{"$f":"D33*1.4","v":47.490351878083416},"bar",null,null,null,null,null,null,null,null,null,null,null,5,2900]
[null,null,null,null,null,null,null,null,null,null,null,null,null,null,null,null,4.9000000000000004,3000]
[null,{"$f":"INDEX(lingue!B318:E318,1,DATOS!$B$5)","v":"PISTÓN"},null,null,null,null,null,null,null,null,null,null,null,null,null,null,4.8,3100]
[null,{"$f":"INDEX(lingue!B319:E319,1,DATOS!$B$5)","v":"1- El sistema de unión entre los elementos del pistón y del cilindro, cuando se fabrica en varias piezas, asegura una resistencia no inferior a la de un pistón de iguales dimensiones construido en una sola pieza"},{"$f":"INDEX(lingue!C319:F319,1,DATOS!$B$5)","v":0},{"$f":"INDEX(lingue!D319:G319,1,DATOS!$B$5)","v":0},{"$f":"INDEX(lingue!E319:H319,1,DATOS!$B$5)","v":0},{"$f":"INDEX(lingue!F319:I319,1,DATOS!$B$5)","v":0},{"$f":"INDEX(lingue!G319:J319,1,DATOS!$B$5)","v":0},null,null,null,null,null,null,null,null,null,4.75,3200]
[null,{"$f":"INDEX(lingue!B320:E320,1,DATOS!$B$5)","v":"2- El límite superior del recorrido del pistón es determinado por el tope del fondo sobre la cabeza del cilindro (tope amortiguado)."},{"$f":"INDEX(lingue!C320:F320,1,DATOS!$B$5)","v":0},{"$f":"INDEX(lingue!D320:G320,1,DATOS!$B$5)","v":0},{"$f":"INDEX(lingue!E320:H320,1,DATOS!$B$5)","v":0},{"$f":"INDEX(lingue!F320:I320,1,DATOS!$B$5)","v":0},{"$f":"INDEX(lingue!G320:J320,1,DATOS!$B$5)","v":0},null,null,null,null,null,null,null,null,null,4.7,3300]
[null,{"$f":"INDEX(lingue!B321:E321,1,DATOS!$B$5)","v":"3- Con la cabina apoyada en la parte inferior, sobre los amortiguadores comprimidos totalmente, el pistón no toca el fondo del cilindro"},{"$f":"INDEX(lingue!C321:F321,1,DATOS!$B$5)","v":0},{"$f":"INDEX(lingue!D321:G321,1,DATOS!$B$5)","v":0},{"$f":"INDEX(lingue!E321:H321,1,DATOS!$B$5)","v":0},{"$f":"INDEX(lingue!F321:I321,1,DATOS!$B$5)","v":0},{"$f":"INDEX(lingue!G321:J321,1,DATOS!$B$5)","v":0},null,null,null,null,null,null,null,null,null,4.6500000000000004,3400,68]
[]
[null,{"$f":"INDEX(lingue!B322:E322,1,DATOS!$B$5)","v":"MATERIAL"}]
[]
[null,{"$f":"INDEX(lingue!B323:E323,1,DATOS!$B$5)","v":"  Modulo de elasticidad                    "},"E =",2100000,"daN /cm^2"]
[null,{"$f":"INDEX(lingue!B324:E324,1,DATOS!$B$5)","v":"  Material:  St  52,0 (NBK)  DIN 1629 / DIN 2391"}]
[null,{"$f":"INDEX(lingue!B325:E325,1,DATOS!$B$5)","v":"  Limite convenzional de elasticidad                "},"Rp0,2 =",355,"N /mm^2"]
[null,{"$f":"INDEX(lingue!B326:E326,1,DATOS!$B$5)","v":"  Resistencia a la tracción del material"},"Rm =",500,"N /mm^2"]
[]
[null,{"$f":"INDEX(lingue!B327:E327,1,DATOS!$B$5)","v":"DATOS DEL PISTON"}]
[null,{"$f":"INDEX(lingue!B328:E328,1,DATOS!$B$5)","v":"  Diametro externo de la varilla          "},"d =",75,"mm"]
[null,{"$f":"INDEX(lingue!B329:E329,1,DATOS!$B$5)","v":"  Diametro interno de la varilla"},"di =",{"$f":"IF(D52=0,0,D50-2*D52)","v":60},"mm"]
[null,{"$f":"INDEX(lingue!B330:E330,1,DATOS!$B$5)","v":"Espesor de la varilla                                  "},"es =",7.5,"mm"]
[null,{"$f":"INDEX(lingue!B331:E331,1,DATOS!$B$5)","v":"  Momento de inercia          pi/640000*(d^4-di^4)      "},"J =",{"$f":"D32/640000*(D50^4-D51^4)","v":91.698303538227862},"cm^4"]
[null,{"$f":"INDEX(lingue!B332:E332,1,DATOS!$B$5)","v":"  Area del la varilla                pi/400*d^2                "},"Av=",{"$f":"D32/400*D50^2","v":44.178646691106472},"cm^2"]
[null,{"$f":"INDEX(lingue!B333:E333,1,DATOS!$B$5)","v":"  Sección resistente           pi/400*(d^2-di^2)         "},"F =",{"$f":"D32/400*(D50^2-D51^2)","v":15.904312808798329},"cm^2"]
[null,{"$f":"INDEX(lingue!B334:E334,1,DATOS!$B$5)","v":"  Radio de inercia           (J/F)^1/2                 "},"i =",{"$f":"SQRT(D53/D55)","v":2.4011715890373182},"cm"]
[null,{"$f":"INDEX(lingue!B335:E335,1,DATOS!$B$5)","v":"VERIFICACIÓN DE  LA CARGA EN PUNTA"}]
[null,{"$f":"INDEX(lingue!B336:E336,1,DATOS!$B$5)","v":"  Grado de esbeltez           L/i                  "},"lambda",{"$f":"D20/D56","v":70.79877205616809},null,{"$f":"IF(D58>=100,\">\",\"<\")","v":"<"},100]
[null,{"$f":"INDEX(lingue!B337:E337,1,DATOS!$B$5)","v":"Carga en punta efectiva"}]
[null,"  F5=1.4*gn/10*[cm*(Q+P3)/Nr+0,64*Pr+Pf+Prh]            ","F5 =",{"$f":"(1.4*D31/10*(D9*(D10+D11)/D14+0.64*D23+D12+D13))","v":2078.9334430865401},"daN"]
[null,{"$f":"INDEX(lingue!B338:E338,1,DATOS!$B$5)","v":"Carga máxima admisible"}]
[null,{"$f":"IF(D58>100,\" F5am=pi^2*E*J/(2*L^2)\",\" F5am=F/2[Rm-(Rm-210)*(lambda/100)^2]\")","v":" F5am=F/2[Rm-(Rm-210)*(lambda/100)^2]"},"F5am",{"$f":"IF(D58>100,D32^2*D44*D53/(2*D20^2),(D55*10/2)*(D47-(D47-210)*(D58/100)^2))","v":28201.406789428769},"daN"]
[]
[null,{"$f":"INDEX(lingue!B339:E339,1,DATOS!$B$5)","v":"COEFICIENTE DE SEGURIDAD"},null,{"$f":"(D62*2)/D60","v":27.130649019296019},null,">",2]
[]
[null,{"$f":"INDEX(lingue!B340:E340,1,DATOS!$B$5)","v":"VERIFICACIÓN DE  RESISTENCIA DE LA PARED A PRESION RADIAL"}]
[null,"  gs=20*Rp0,2*(es-0,5)/(2,3*pstat*d) => 1,7             ","gs =",{"$f":"IF(D52=0,\"MACIZO\",20*D46*(D52-0.5)/(2.3*D33*D50))","v":8.4935634900344805},null,">",1.7]
[null,{"$f":"INDEX(lingue!B341:E341,1,DATOS!$B$5)","v":"CILINDRO"}]
[null,{"$f":"INDEX(lingue!B342:E342,1,DATOS!$B$5)","v":"  Material:  St  52,0 (NBK)  DIN 1629 / DIN 2448"}]
[null,{"$f":"INDEX(lingue!B343:E343,1,DATOS!$B$5)","v":"  Limite convenzional de elasticidad          "},"Rp0,2 =",355,"N /mm^2"]
[null,{"$f":"INDEX(lingue!B344:E344,1,DATOS!$B$5)","v":"DATO DEL CILINDRO"}]
[null,{"$f":"INDEX(lingue!B345:E345,1,DATOS!$B$5)","v":"  Modelo Piston"},null,{"$f":"DATOS!D7","v":9130}]
[null,{"$f":"INDEX(lingue!B346:E346,1,DATOS!$B$5)","v":"  Diametro externo del cilindro                          "},"D =",90,"mm"]
[null,{"$f":"INDEX(lingue!B347:E347,1,DATOS!$B$5)","v":"  Diametro interno del cilindro                        "},"Di =",{"$f":"D73-2*D75","v":80},"mm"]
[null,{"$f":"INDEX(lingue!B348:E348,1,DATOS!$B$5)","v":"  Espesor del cilindro                        "},"ecy1 =",5,"mm"]
[null,"  Area interna de la camisa      pi/400*Di^2","A=",{"$f":"D32/400*D74^2","v":50.265482457436697},"mm"]
[null,{"$f":"INDEX(lingue!B349:E349,1,DATOS!$B$5)","v":"VERIFICACIÓN PRESIÓN INTERNA DEL CILINDRO"}]
[null,"  gc=20*Rp0,2*(ecy1-1)/2,3*pstat*Di) => 1,7              ","gc =",{"$f":"20*D46*(D75-1)/(2.3*D33*D74)","v":4.5501232982327569},null,">",1.7]
[null,{"$f":"INDEX(lingue!B350:E350,1,DATOS!$B$5)","v":"VERIFICACIÓN A PRESIÓN INTERNA DEL FONDO DEL CILINDRO (CON RANURA DE DESAHOGO)"}]
[null,{"$f":"INDEX(lingue!B351:E351,1,DATOS!$B$5)","v":"  Espesor de la pared interna de la ranura       "},"s1 =",6.5,"mm"]
[null,{"$f":"INDEX(lingue!B352:E352,1,DATOS!$B$5)","v":"  Espesor del fondo                  "},"e1 = h1 =",13,"mm"]
[null,"    ge1=10*Rp0,2*(e1-1)^2/(0,16*2,3*pstat*Di^2)       ","ge1 =",{"$f":"10*D46*(D81-1)^2/(0.16*2.3*D33*D74^2)","v":6.3986108881398147},"mm",">","1,7"]
[null,"    h1 >= u1 + r1                                       ","h1 =",{"$f":"D81","v":13},"mm",">",{"$f":"D87+D84","v":11.2}]
[null,{"$f":"INDEX(lingue!B353:E353,1,DATOS!$B$5)","v":"  Radio de la ranura de desahogo                         "},"r1 =",5,"mm"]
[null,"    r1 >= 5                                             ","r1 =",{"$f":"D84","v":5},"mm"]
[null,"    r1 >= 0,2*s1                                        ","r1 =",{"$f":"D84","v":5},"mm",">",{"$f":"0.2*D80","v":1.3},null,null,null,"r1","mm",5]
[null,{"$f":"INDEX(lingue!B354:E354,1,DATOS!$B$5)","v":"  Espesor del fondo de la ranura de desahogo        "},"u1 =",6.2,"mm",null,null,null,null,null,"s1","mm"]
[null,"    gu1=10*Rp0,2*(u1-1)/[1,3*2,3*pstat*(D1/2-r1)]    ","gu1 =",{"$f":"10*D70*(D87-1)/(1.3*2.3*D33*(D74/2-D84))","v":5.2001409122660087},"mm",">",1.7,null,null,null,"h1","mm",13]
[null,"    u1 =< 1,5*s1                                       ","u1 =",{"$f":"D87","v":6.2},"mm","<",{"$f":"1.5*D80","v":9.75},null,null,null,"u1","mm",6.2]
[null,{"$f":"INDEX(lingue!B355:E355,1,DATOS!$B$5)","v":"CONDUCCIÓN DE CONEXIÓN ENTRE LA CENTRAL Y LA VÁLVULA PARACAÍDAS"}]
[null,{"$f":"INDEX(lingue!B356:E356,1,DATOS!$B$5)","v":"  Material: St 37,0  (GBK) DIN 1629 / DIN 2391"}]
[null,{"$f":"INDEX(lingue!B357:E357,1,DATOS!$B$5)","v":"  Limite convencional de elasticidad          "},"Rp0,2 =",235,"N /mm^2"]
[null,{"$f":"INDEX(lingue!B358:E358,1,DATOS!$B$5)","v":"  Diámetro externo de la conducción         "},"Dt =",35,"mm "]
[null,{"$f":"INDEX(lingue!B359:E359,1,DATOS!$B$5)","v":"  Espesor de la conducción                                 "},"et =",2.5,"mm"]
[null,{"$f":"INDEX(lingue!B360:E360,1,DATOS!$B$5)","v":"VERIFICACIÓN DE LA PRESIÓN INTERNA"}]
[null,"  gt=20*Rp0,2*(et-0,5)/(2,3*pstat*Dt)      >= 1,7","gt =",{"$f":"20*D92*(D94-0.5)/(2.3*D33*D93)","v":3.4423468010774982},null,">",1.7]
[]
[null,{"$f":"INDEX(lingue!B361:E361,1,DATOS!$B$5)","v":"Las válvulas y todas las conexión están calculadas y construidas de modo que, bajo los esfuerzos derivados de una persión 2,3 veces la presion estática máxima, está garantizado un coeficiente de seguridad de 1,7 respecto al límite convencional de Rp0,2"},{"$f":"INDEX(lingue!C363:F363,1,DATOS!$B$5)","v":0},{"$f":"INDEX(lingue!D363:G363,1,DATOS!$B$5)","v":0},{"$f":"INDEX(lingue!E363:H363,1,DATOS!$B$5)","v":0},{"$f":"INDEX(lingue!F363:I363,1,DATOS!$B$5)","v":0},{"$f":"INDEX(lingue!G363:J363,1,DATOS!$B$5)","v":0}]
[]
[]
[]
[]
[]
[null,{"$f":"INDEX(lingue!B364:E364,1,DATOS!$B$5)","v":"SELLO Y FIRMA __________________________________"},null,{"$f":"TODAY()","v":"2023-11-30"}]
[]
[]
[]
[]
[null,"PARAMETRO 1",{"$f":"MATCH(D50,database1!C72:Q72,0)","v":{"$error":"#N/A"}}]
[null,"PARAMETRO 2 ",{"$f":"MATCH(D52,database1!C26:C31,0)","v":4}]
[null,"PARAMETRO 3",{"$f":"MATCH(D50,database1!D7:R7,0)","v":{"$error":"#N/A"}}]
[]
[]
[]
[]
[null,"massa giunta pistone",{"$f":"IF(D50<=60,0,INDEX(database1!E63:R67,C110,C111)*(D15-1))","v":{"$error":"#N/A"}},"por piston"]
[null,"masa piston 9130",{"$f":"INDEX(database1!E39:R43,C110,C111)+(D17/100-3)*INDEX(database1!E57:R61,C110,C111)","v":{"$error":"#N/A"}},"por piston","masa primer tramo 3 metros + massa del la  diferencia (incluso negativa)"]
[null,"masa piston 9140",{"$f":"INDEX(database1!E45:R49,C110,C111)+(D17/100-3)*INDEX(database1!E57:R61,C110,C111)","v":{"$error":"#N/A"}},"por piston"]
[null,"masa piston 9150",{"$f":"INDEX(database1!E51:R55,C110,C111)+(D17/100-3)*INDEX(database1!E57:R61,C110,C111)","v":{"$error":"#N/A"}},"por piston"]
[]
[null,"peso totale pistón",{"$f":"(IF('accessori centralina'!B5=9130,'EN 81.50 HCR-75'!C117,IF('accessori centralina'!B5=9140,'EN 81.50 HCR-75'!C118,'EN 81.50 HCR-75'!C119))+'EN 81.50 HCR-75'!C116)*D14","v":{"$error":"#N/A"}}]

{"sheet":"velocidad","index":15,"n_rows":146,"n_cols":92,"rows_kept":146,"cut":false,"hidden":false,"merged":[[1,1,1,15],[2,1,2,15],[77,1,77,35],[1,19,1,35]]}
[null,"real"]
[null,"VELOCITA' CENTRALINA 50hz",null,null,null,null,null,null,null,null,null,null,null,null,null,null,null,null,null,"VELOCITA' CENTRALINA 60Hz",null,null,null,null,null,null,null,null,null,null,null,null,null,null,null,null,null,null,"SETTIMA"]
["teorico","DIAMETRO PISTONE",null,null,null,null,null,null,null,null,null,null,null,null,null,null,"real",null,null,null,null,"DIAMETRO PISTONE",null,null,null,null,null,null,null,null,null,null,null,null,null,null,null,null,null,null,null,null,null,null,null,null,null,null,null,null,null,null,null,null,null,null,null,null,null,null,null,null,null,null,"Teórica","\"REAL 50HZ\"",null,null,null,null,null,null,null,null,null,null,null,"Area dm^2",null,null,null,null,null,null,null,null,null,null,null,null,"VISCOSIDAD VERKOL HM46"]
["POMPA",36,50,60,70,80,85,90,100,110,120,130,150,160,180,200,238,76.099999999999994,null,"POMPA",null,"POMPA",36,50,60,70,80,85,90,100,110,120,130,150,160,180,200,238,76.099999999999994,null,null,null,null,null,null,null,null,null,null,null,null,null,null,null,null,null,null,null,null,null,null,null,null,null,"POMPA","POMPA","%DES",36,50,60,70,75,80,85,90,100,160,null,36,50,60,70,75,80,85,90,100,160,null,null,"T(ºC)","Viscosidad (cSt)"]
[8,0.13097576948264572,0.06,0.04,0.03,0.02,0.02,0.02,"x","x","x","x","x","x","x","x","x",0.02,null,10,null,8,{"$f":"B5*1.2","v":0.15717092337917485},7.1999999999999995E-2,4.8000000000000001E-2,3.5999999999999997E-2,2.4E-2,2.4E-2,2.4E-2,"x","x","x","x","x","x","x","x","x",{"$f":"R5*1.2","v":2.4E-2},null,null,null,null,null,null,null,null,null,null,null,null,null,null,null,null,null,null,null,null,null,null,null,null,null,8,8,{"$f":"BN5/BM5","v":1},{"$f":"$BN5/(CA5*600)","v":0.13097576948264572},{"$f":"$BN5/(CB5*600)","v":6.7923246731193751E-2},4.7164249498879846E-2,3.4650034650034647E-2,2.5513458349279251E-2,2.5513458349279251E-2,2.3494860499265784E-2,2.0961064822092961E-2,1.6976487564722857E-2,1.4030187820773142E-2,null,0.1018,0.1963,0.28270000000000001,0.38479999999999998,0.52259999999999995,0.52259999999999995,0.5675,0.6361,0.78539999999999999,{"$f":"PI()*1.1^2/4","v":0.9503317777109126},null,null,5,383.56]
[12,0.19646365422396858,0.1,7.0000000000000007E-2,0.05,0.04,0.03,0.03,"x","x","x","x","x","x","x","x","x",0.04,null,15,null,12,0.23575638506876229,0.12,8.4000000000000005E-2,0.06,4.8000000000000001E-2,3.5999999999999997E-2,3.5999999999999997E-2,"x","x","x","x","x","x","x","x","x",4.8000000000000001E-2,null,null,null,null,null,null,null,null,null,null,null,null,null,null,null,null,null,null,null,null,null,null,null,null,null,12,12,1,0.19646365422396858,0.10188487009679062,7.0746374248319768E-2,5.1975051975051978E-2,3.8270187523918871E-2,3.8270187523918871E-2,3.5242290748898682E-2,3.144159723313944E-2,2.5464731347084289E-2,2.1045281731159712E-2,null,0.1018,0.1963,0.28270000000000001,0.38479999999999998,0.52259999999999995,0.52259999999999995,0.5675,0.6361,0.78539999999999999,{"$f":"PI()*1.1^2/4","v":0.9503317777109126},null,null,10,262.47000000000003]
[15,0.24557956777996071,0.12,0.08,0.06,0.05,0.04,0.04,"x","x","x","x","x","x","x","x","x",0.05,null,19,null,15,0.29469548133595286,0.14399999999999999,9.6000000000000002E-2,7.1999999999999995E-2,0.06,4.8000000000000001E-2,4.8000000000000001E-2,"x","x","x","x","x","x","x","x","x",0.06,null,null,null,null,null,null,null,null,null,null,null,null,null,null,null,null,null,null,null,null,null,null,null,null,null,15,15,1,0.24557956777996071,0.1273560876209883,8.8432967810399721E-2,6.4968814968814972E-2,4.7837734404898594E-2,4.7837734404898594E-2,4.405286343612335E-2,3.93019965414243E-2,3.1830914183855356E-2,{"$f":"$BN7/(CJ7*600)","v":2.630660216394964E-2},null,0.1018,0.1963,0.28270000000000001,0.38479999999999998,0.52259999999999995,0.52259999999999995,0.5675,0.6361,0.78539999999999999,0.9503317777109126,null,null,15,185.04]
[18,0.29469548133595286,0.15,0.1,7.0000000000000007E-2,0.06,0.05,0.05,"x","x","x","x","x","x","x","x","x",0.06,null,22,null,18,0.35363457760314343,0.18,0.12,8.4000000000000005E-2,7.1999999999999995E-2,0.06,0.06,"x","x","x","x","x","x","x","x","x",7.1999999999999995E-2,null,null,null,null,null,null,null,null,null,null,null,null,null,null,null,null,null,null,null,null,null,null,null,null,null,18,18,1,0.29469548133595286,0.15282730514518594,0.10611956137247966,7.7962577962577967E-2,5.740528128587831E-2,5.740528128587831E-2,5.2863436123348019E-2,4.716239584970916E-2,3.819709702062643E-2,{"$f":"$BN8/(CJ8*600)","v":3.1567922596739566E-2},null,0.1018,0.1963,0.28270000000000001,0.38479999999999998,0.52259999999999995,0.52259999999999995,0.5675,0.6361,0.78539999999999999,0.9503317777109126,null,null,20,134.01]
[23,0.37655533726260643,0.19,0.13,0.09,7.0000000000000007E-2,0.06,0.06,0.05,"x","x","x","x","x","x","x","x",7.0000000000000007E-2,null,27,null,23,0.45186640471512768,0.22799999999999998,0.156,0.108,8.4000000000000005E-2,7.1999999999999995E-2,7.1999999999999995E-2,{"$f":"I9*1.2","v":0.06},"x","x","x","x","x","x","x","x",8.4000000000000005E-2,null,null,null,null,null,null,null,null,null,null,null,null,null,null,null,null,null,null,null,null,null,null,null,null,null,23,23,1,0.37655533726260643,0.19527933435218203,0.13559721730927957,9.961884961884962E-2,7.3351192754177841E-2,7.3351192754177841E-2,6.7547723935389131E-2,6.0263061363517265E-2,4.8807401748578221E-2,4.033678998472278E-2,null,0.1018,0.1963,0.28270000000000001,0.38479999999999998,0.52259999999999995,0.52259999999999995,0.5675,0.6361,0.78539999999999999,0.9503317777109126,null,null,25,99.45]
[30,"x",0.25,0.17,0.12,0.1,0.08,7.4999999999999997E-2,0.06,0.05,"x","x","x","x","x","x","x",0.1,null,null,null,30,"x",{"$f":"C10*1.2","v":0.3},0.20400000000000001,0.14399999999999999,0.12,9.6000000000000002E-2,0.09,7.1999999999999995E-2,{"$f":"J10*1.2","v":0.06},"x","x","x","x","x","x","x",0.12,null,null,null,null,null,null,null,null,null,null,null,null,null,null,null,null,null,null,null,null,null,null,null,null,null,35,75,2.1428571428571428,1.2278978388998036,0.63678043810494145,0.44216483905199855,0.32484407484407485,0.23918867202449295,0.23918867202449295,0.22026431718061673,0.1965099827071215,0.15915457091927679,{"$f":"$BN10/(CJ10*600)","v":6.2169899645271615E-2},null,0.1018,0.1963,0.28270000000000001,0.38479999999999998,0.52259999999999995,0.52259999999999995,0.5675,0.6361,0.78539999999999999,{"$f":"PI()*1.6^2/4","v":2.0106192982974678},null,null,30,75.44]
[35,"x",0.3,0.2,0.15,0.11,0.1,0.09,7.0000000000000007E-2,0.06,"x","x","x","x","x","x","x",0.11,null,null,null,35,"x",0.36,0.24,0.18,0.13200000000000001,0.12,0.108,8.4000000000000005E-2,7.1999999999999995E-2,"x","x","x","x","x","x","x",0.13200000000000001,null,null,null,null,null,null,null,null,null,null,null,null,null,null,null,null,null,null,null,null,null,null,null,null,null,null,null,null,null,null,null,null,null,null,null,null,null,null,{"$f":"PI()*0.36^2/4","v":0.10178760197630929},null,null,null,null,null,null,null,null,null,null,null,null,35,58.38]
[45,"x",0.38206826286296486,0.26529890343119916,0.1949064449064449,0.14351320321469577,0.13215859030837004,0.1179059896242729,9.5492742551566076E-2,7.8919806491848918E-2,"x","x","x",0.04,"x","x","x",0.14351320321469577,null,null,null,45,"x",0.45848191543555783,0.31835868411743901,0.23388773388773387,0.17221584385763491,0.15859030837004404,0.14148718754912748,0.11459129106187929,9.4703767790218704E-2,"x","x","x","x","x","x","x",0.17221584385763491,null,null,null,null,null,null,null,null,null,null,null,null,null,null,null,null,null,null,null,null,null,null,null,null,null,null,null,null,null,null,null,null,null,null,null,null,null,null,{"$f":"PI()*0.7*0.7/4","v":0.38484510006474965},null,null,null,null,null,null,null,null,null,null,null,null,40,46]
[55,"x",0.44,0.3,0.22,0.17,0.16,0.13,0.11,0.09,0.08,0.06,"x",0.05,"x","x","x","x",null,null,null,55,"x",0.52800000000000002,0.36,0.26400000000000001,0.20400000000000001,0.192,0.156,0.13200000000000001,0.108,{"$f":"K13*1.2","v":9.6000000000000002E-2},{"$f":"L13*1.2","v":7.1999999999999995E-2},"x","x","x","x","x","x",null,null,null,null,null,null,null,null,null,null,null,null,null,null,null,null,null,null,null,null,null,null,null,null,null,null,10,null,null,null,null,null,null,null,null,null,null,null,null,null,null,null,null,null,null,null,null,null,null,null,null,45,36.85]
[75,"x",0.6,0.42,0.31,0.25,0.22,0.18,0.15,0.12,0.11,0.09,0.06,0.06,"x","x","x","x",null,null,null,75,"x",0.72,0.504,0.372,0.3,0.26400000000000001,0.216,0.18,0.14399999999999999,0.13200000000000001,0.108,{"$f":"M14*1.2","v":7.1999999999999995E-2},"x","x","x","x","x",null,null,null,null,null,null,null,null,null,null,null,null,null,null,null,null,null,null,null,null,null,null,null,null,null,null,15,null,null,null,null,null,null,null,null,null,null,null,null,null,null,null,null,null,null,null,null,null,null,null,null,50,29.96]
[100,"x","x",0.56999999999999995,0.42,0.31,0.28999999999999998,0.26,0.2,0.17,0.15,0.12,0.09,0.08,0.06,"x","x","x",null,null,null,100,"x","x",{"$f":"D15*1.2","v":0.68399999999999994},0.504,0.372,0.34799999999999998,0.312,0.24,0.20400000000000001,0.18,0.14399999999999999,0.108,{"$f":"N15*1.2","v":9.6000000000000002E-2},{"$f":"O15*1.2","v":7.1999999999999995E-2},"x","x","x",null,null,null,null,null,null,null,null,null,null,null,null,null,null,null,null,null,null,null,null,null,null,null,null,null,null,19,null,null,null,null,null,null,null,null,null,null,null,null,null,null,null,null,null,null,null,null,null,null,null,null,55,24.69]
[125,"x","x",0.71,0.52,0.4,0.36,0.31,0.26,0.21,0.18,0.15,0.11,0.1,7.0000000000000007E-2,0.06,"x","x",null,null,null,125,"x","x",0.85199999999999998,0.624,0.48,0.432,0.372,0.312,0.252,0.216,0.18,0.13200000000000001,0.12,8.4000000000000005E-2,{"$f":"P16*1.2","v":7.1999999999999995E-2},"x","x",null,null,null,null,null,null,null,null,null,null,null,null,null,null,null,null,null,null,null,null,null,null,null,null,null,null,22,null,null,null,null,null,null,null,null,null,null,null,null,null,null,null,null,null,null,null,null,null,null,null,null,60,20.61]
[150,"x","x","x",0.61,0.47,0.44,0.37,0.31,0.26,0.21,0.18,0.13,0.12,0.09,7.0000000000000007E-2,"x","x",null,null,null,150,"x","x","x",{"$f":"E17*1.2","v":0.73199999999999998},0.56399999999999995,0.52800000000000002,0.44400000000000001,0.372,0.312,0.252,0.216,0.156,0.14399999999999999,0.108,8.4000000000000005E-2,"x","x",null,null,null,null,null,null,null,null,null,null,null,null,null,null,null,null,null,null,null,null,null,null,null,null,null,null,27,null,null,null,null,null,null,null,null,null,null,null,null,null,null,null,null,null,null,null,null,null,null,null,null,65,17.39]
[180,"x","x","x",0.76,0.57999999999999996,0.52,0.46,0.37,0.31,0.26,0.22,0.16,0.15,0.11,0.09,0.06,"x",null,null,null,180,"x","x","x",0.91199999999999992,0.69599999999999995,0.624,0.55200000000000005,0.44400000000000001,0.372,0.312,0.26400000000000001,0.192,0.18,0.13200000000000001,0.108,{"$f":"Q18*1.2","v":7.1999999999999995E-2},"x",null,null,null,null,null,null,null,null,null,null,null,null,null,null,null,null,null,null,null,null,null,null,null,null,null,null,43,null,null,null,null,null,null,null,null,null,null,null,null,null,null,null,null,null,null,null,null,null,null,null,null,70,12.77]
[210,"x","x","x","x",0.67,0.61,0.53,0.43,0.36,0.31,0.26,0.2,0.17,0.13,0.1,7.0000000000000007E-2,"x",null,null,null,210,"x","x","x","x",{"$f":"F19*1.2","v":0.80400000000000005},0.73199999999999998,0.63600000000000001,0.51600000000000001,0.432,0.372,0.312,0.24,0.20400000000000001,0.156,0.12,8.4000000000000005E-2,"x"]
[250,"x","x","x","x",0.8,0.73,0.65,0.52,0.43,0.36,0.31,0.23,0.21,0.16,0.13,0.09,"x",null,null,null,250,"x","x","x","x",0.96,0.876,0.78,0.624,0.51600000000000001,0.432,0.372,0.27600000000000002,0.252,0.192,0.156,0.108,"x"]
[300,"x","x","x","x","x","x",0.75,0.61,0.5,0.43,0.36,0.27,0.25,0.2,0.15,0.11,"x",null,null,null,300,"x","x","x","x","x","x",{"$f":"H21*1.2","v":0.89999999999999991},0.73199999999999998,0.6,0.51600000000000001,0.432,0.32400000000000001,0.3,0.24,0.18,0.13200000000000001,"x"]
[330,"x","x","x","x","x","x",0.82,0.67,0.55000000000000004,0.47,0.39,0.28999999999999998,0.27,0.22,0.16,0.12,"x",null,null,null,330,"x","x","x","x","x","x",{"$f":"H22*1.2","v":0.98399999999999987},0.80400000000000005,0.66,0.56399999999999995,0.46799999999999997,0.34799999999999998,0.32400000000000001,0.26400000000000001,0.192,0.14399999999999999,"x"]
[380,"x","x","x","x","x","x","x",0.77,0.65,0.55000000000000004,0.45,0.35,0.31,0.24,0.2,0.13,"x",null,null,null,380,"x","x","x","x","x","x","x",0.92399999999999993,0.78,0.66,0.54,0.42,0.372,0.28799999999999998,0.24,0.156,"x"]
[440,"x","x","x","x","x","x","x",0.93,0.77,0.64,0.55000000000000004,0.41,0.36,0.28000000000000003,0.23,0.16,"x",null,null,null,440,"x","x","x","x","x","x","x",1.1160000000000001,0.92399999999999993,0.76800000000000002,0.66,0.49199999999999994,0.432,0.33600000000000002,0.27600000000000002,0.192,"x"]
[500,"x","x","x","x","x","x","x","x",0.85,0.73,0.62,0.47,0.41,0.32,0.26,0.18,"x",null,null,null,500,"x","x","x","x","x","x","x","x",1.02,0.876,0.74399999999999999,0.56399999999999995,0.49199999999999994,0.38400000000000001,0.312,0.216,"x"]
[650,"x","x","x","x","x","x","x","x","x",0.95,0.81,0.61,0.53,0.42,0.34,0.24,"x",null,null,null,650,"x","x","x","x","x","x","x","x","x",1.1399999999999999,0.97199999999999998,0.73199999999999998,0.63600000000000001,0.504,0.40800000000000003,0.28799999999999998,"x",null,null,null,null,null,null,null,null,"SEIM"]
[]
[null,"POTENZA CENTRALINA MECCANICA 50HZ kW"]
[null,"PRESSIONE"]
["pompa",12,13,14,15,16,17,18,19,20,21,22,23,24,25,26,27,28,29,30,31,32,33,34,35,36,37,38,39,40,41,42,43,44,45,46,47,48,49,50,51,52,53,54,55,56,57,58,59,60]
["HL8M","x","x","x","x",0.75,0.75,0.75,0.75,0.75,0.75,0.75,0.75,0.75,0.75,0.75,0.75,0.75,0.75,0.75,0.75,0.75,0.75,1.1000000000000001,1.1000000000000001,1.1000000000000001,1.1000000000000001,1.1000000000000001,1.1000000000000001,1.1000000000000001,1.1000000000000001,1.1000000000000001,1.1000000000000001,1.1000000000000001,1.1000000000000001,1.1000000000000001,"x","x","x","x","x","x"]
["HL12M","x","x","x","x",0.75,0.75,0.75,0.75,0.75,0.75,0.75,1.1000000000000001,1.1000000000000001,1.1000000000000001,1.1000000000000001,1.1000000000000001,1.1000000000000001,1.1000000000000001,1.1000000000000001,1.1000000000000001,1.1000000000000001,1.1000000000000001,1.5,1.5,1.5,1.5,1.5,1.5,1.5,1.5,1.5,1.5,1.5,1.5,"X","x","x","x","x","x","x"]
["HL18M","x","x","x","x",1.1000000000000001,1.1000000000000001,1.1000000000000001,1.1000000000000001,1.1000000000000001,1.1000000000000001,1.1000000000000001,1.1000000000000001,1.1000000000000001,1.1000000000000001,1.1000000000000001,1.1000000000000001,1.5,1.5,1.5,1.5,1.5,1.5,1.5,1.5,1.5,1.8,1.8,1.8,1.8,1.8,1.8,1.8,1.8,1.8,"X","x","x","x","x","x","x"]
["HL23M","x","x","x","x",1.5,1.5,1.5,1.5,1.5,1.5,1.5,1.5,1.8,1.8,1.8,1.8,1.8,1.8,2.2000000000000002,2.2000000000000002,2.2000000000000002,2.2000000000000002,2.2000000000000002,2.2000000000000002,2.2000000000000002,"X","X","X","X","X","X","X","X","X","X","x","x","x","x","x","x"]
["HL8T","x","x","x","x",0.75,0.75,0.75,0.75,0.75,0.75,0.75,0.75,0.75,0.75,0.75,0.75,0.75,0.75,0.75,0.75,0.75,0.75,0.75,0.75,0.75,0.75,0.75,0.75,0.75,0.75,0.75,1.1000000000000001,1.1000000000000001,1.1000000000000001,1.1000000000000001,"x","x","x","x","x","x"]
["HL12T","x","x","x","x",0.75,0.75,0.75,0.75,0.75,0.75,0.75,0.75,0.75,0.75,0.75,0.75,0.75,1.1000000000000001,1.1000000000000001,1.1000000000000001,1.1000000000000001,1.1000000000000001,1.1000000000000001,1.1000000000000001,1.1000000000000001,1.1000000000000001,1.1000000000000001,1.1000000000000001,1.1000000000000001,1.1000000000000001,1.1000000000000001,1.5,1.5,1.5,1.5,"x","x","x","x","x","x"]
["HL18T","x","x","x","x",0.75,0.75,0.75,0.75,0.75,0.75,0.75,1.1000000000000001,1.1000000000000001,1.1000000000000001,1.1000000000000001,1.1000000000000001,1.1000000000000001,1.1000000000000001,1.1000000000000001,1.1000000000000001,1.1000000000000001,1.1000000000000001,1.1000000000000001,1.5,1.5,1.5,1.5,1.5,1.5,1.5,1.5,1.5,1.5,1.5,"X","x","x","x","x","x","x"]
["HL23T","x","x","x","x",1.1000000000000001,1.1000000000000001,1.1000000000000001,1.1000000000000001,1.1000000000000001,1.1000000000000001,1.1000000000000001,1.5,1.5,1.5,1.5,1.5,1.5,1.5,2.2000000000000002,2.2000000000000002,2.2000000000000002,2.2000000000000002,2.2000000000000002,2.2000000000000002,2.2000000000000002,2.2000000000000002,2.2000000000000002,2.2000000000000002,2.2000000000000002,2.2000000000000002,2.2000000000000002,2.2000000000000002,2.2000000000000002,"X","X","x","x","x","x","x","x"]
["HL12MD","x","x","x","x",0.75,0.75,0.75,0.75,0.75,0.75,0.75,1.1000000000000001,1.1000000000000001,1.1000000000000001,1.1000000000000001,1.1000000000000001,1.1000000000000001,1.1000000000000001,1.1000000000000001,1.1000000000000001,1.1000000000000001,1.5,1.5,1.5,1.5,1.5,1.5,1.5,1.5,1.5,1.5,1.5,1.5,1.5,"X","x","x","x","x","x","x"]
["HL18MD","x","x","x","x",1.1000000000000001,1.1000000000000001,1.1000000000000001,1.1000000000000001,1.1000000000000001,1.1000000000000001,1.1000000000000001,1.1000000000000001,1.1000000000000001,1.1000000000000001,1.1000000000000001,1.1000000000000001,1.5,1.5,1.5,1.5,1.5,1.5,1.5,1.5,1.5,1.8,1.8,1.8,1.8,1.8,1.8,1.8,1.8,1.8,"X","x","x","x","x","x","x"]
["HL23MD","x","x","x","x",1.5,1.5,1.5,1.5,1.5,1.5,1.5,1.5,1.8,1.8,1.8,1.8,1.8,1.8,2.2000000000000002,2.2000000000000002,2.2000000000000002,2.2000000000000002,2.2000000000000002,2.2000000000000002,2.2000000000000002,3,3,3,3,3,3,3,3,3,"X","x","x","x","x","x","x"]
["HL30MD","x","x","x","x",1.8,1.8,1.8,1.8,1.8,1.8,1.8,1.8,2.2000000000000002,2.2000000000000002,2.2000000000000002,2.2000000000000002,2.2000000000000002,3,3,3,3,3,3,3,3,3,"X","X","X","X","X","X","X","X","X","x","x","x","x","x","x"]
["HL12TD","x","x","x","x",0.75,0.75,0.75,0.75,0.75,0.75,0.75,0.75,0.75,0.75,0.75,0.75,0.75,1.1000000000000001,1.1000000000000001,1.1000000000000001,1.1000000000000001,1.1000000000000001,1.1000000000000001,1.1000000000000001,1.1000000000000001,1.1000000000000001,1.1000000000000001,1.1000000000000001,1.1000000000000001,1.1000000000000001,1.5,1.5,1.5,1.5,1.5,"x","x","x","x","x","x"]
["HL18TD","x","x","x","x",0.75,0.75,0.75,0.75,0.75,0.75,0.75,1.1000000000000001,1.1000000000000001,1.1000000000000001,1.1000000000000001,1.1000000000000001,1.1000000000000001,1.1000000000000001,1.1000000000000001,1.1000000000000001,1.1000000000000001,1.1000000000000001,1.1000000000000001,1.5,1.5,1.5,1.5,1.5,1.5,1.5,1.5,1.5,1.5,1.5,"X","x","x","x","x","x","x"]
["HL23TD","x","x","x","x",1.1000000000000001,1.1000000000000001,1.1000000000000001,1.1000000000000001,1.1000000000000001,1.1000000000000001,1.1000000000000001,1.5,1.5,1.5,1.5,1.5,1.5,1.5,2.2000000000000002,2.2000000000000002,2.2000000000000002,2.2000000000000002,2.2000000000000002,2.2000000000000002,2.2000000000000002,2.2000000000000002,2.2000000000000002,2.2000000000000002,2.2000000000000002,2.2000000000000002,2.2000000000000002,2.2000000000000002,2.2000000000000002,"X","X","x","x","x","x","x","x"]
["HL30TD","x","x","x","x",1.5,1.5,1.5,1.5,1.5,1.5,1.5,2.2000000000000002,2.2000000000000002,2.2000000000000002,2.2000000000000002,2.2000000000000002,2.2000000000000002,2.2000000000000002,2.2000000000000002,2.2000000000000002,2.2000000000000002,2.2000000000000002,2.2000000000000002,3,3,3,3,3,3,3,3,3,3,3,"X","x","x","x","x","x","x"]
["8M",1.5,1.5,1.5,1.5,1.5,1.5,1.5,1.5,1.5,1.5,1.5,1.5,1.5,1.5,1.5,1.5,1.5,1.5,1.5,1.5,1.5,1.5,1.5,1.5,1.5,1.5,1.5,1.5,2.2000000000000002,2.2000000000000002,2.2000000000000002,2.2000000000000002,2.2000000000000002,2.2000000000000002,2.2000000000000002,2.2000000000000002,2.2000000000000002,2.2000000000000002,2.2000000000000002,2.2000000000000002,2.2000000000000002,2.2000000000000002,2.2000000000000002,2.2000000000000002,2.2000000000000002,2.2000000000000002,2.2000000000000002,2.2000000000000002,2.2000000000000002]
["12M",1.5,1.5,1.5,1.5,1.5,1.5,1.5,1.5,1.5,1.5,1.5,1.5,1.5,1.5,1.5,1.5,1.5,1.5,1.5,1.5,1.5,1.5,1.5,1.5,1.5,1.5,1.5,1.5,2.2000000000000002,2.2000000000000002,2.2000000000000002,2.2000000000000002,2.2000000000000002,2.2000000000000002,2.2000000000000002,2.2000000000000002,2.2000000000000002,2.2000000000000002,2.2000000000000002,2.2000000000000002,2.2000000000000002,2.2000000000000002,2.2000000000000002,2.2000000000000002,2.2000000000000002,2.2000000000000002,2.2000000000000002,2.2000000000000002,2.2000000000000002]
["18M",1.5,1.5,1.5,1.5,1.5,1.5,1.5,1.5,1.5,1.5,1.5,1.5,1.5,1.5,1.5,1.5,1.5,1.5,1.5,1.5,1.5,1.5,1.5,1.5,1.5,1.5,1.5,1.5,2.2000000000000002,2.2000000000000002,2.2000000000000002,2.2000000000000002,2.2000000000000002,2.2000000000000002,2.2000000000000002,2.2000000000000002,2.2000000000000002,2.2000000000000002,2.2000000000000002,2.2000000000000002,2.2000000000000002,2.2000000000000002,2.2000000000000002,2.2000000000000002,2.2000000000000002,2.2000000000000002,2.2000000000000002,2.2000000000000002,2.2000000000000002]
["23M",1.5,1.5,1.5,1.5,1.5,1.5,1.5,1.5,1.5,1.5,1.5,1.5,1.5,1.5,2.2000000000000002,2.2000000000000002,2.2000000000000002,2.2000000000000002,2.2000000000000002,2.2000000000000002,2.2000000000000002,2.2000000000000002,2.2000000000000002,2.2000000000000002,2.2000000000000002,2.2000000000000002,3,3,3,3,3,3,3,3,3,3,3,3,3,3,3,3,3,3,3,3,3,3,3]
["30M",2.2000000000000002,2.2000000000000002,2.2000000000000002,2.2000000000000002,2.2000000000000002,2.2000000000000002,2.2000000000000002,2.2000000000000002,2.2000000000000002,2.2000000000000002,2.2000000000000002,2.2000000000000002,2.2000000000000002,3,3,3,3,3,3,3,3,3,3,3,3.7,3.7,3.7,3.7,3.7,3.7,3.7,3.7,3.7,3.7,3.7,3.7,3.7,3.7,3.7,3.7,3.7,3.7,3.7,3.7,3.7,3.7,3.7,3.7,3.7]
["35M",2.2000000000000002,2.2000000000000002,2.2000000000000002,2.2000000000000002,3.7,3.7,3.7,3.7,3.7,3.7,3.7,3.7,3.7,3,3,3,3,3,3,3,3,3,3,3,3.7,3.7,3.7,3.7,3.7,3.7,3.7,3.7,3.7,3.7,3.7,3.7,3.7,3.7,3.7,3.7,3.7,3.7,3.7,3.7,3.7,3.7,3.7,3.7,3.7]
["45M",3,3,3,3,3.7,3.7,3.7,3.7,3.7,3.7,3.7,3.7,3.7,3.7,4.8,4.8,4.8,4.8,4.8,4.8,4.8,4.8,4.8,4.8,6,6,6,6,6,6,6,"x","x","x","x","x","x","x","x","x","x","x","x","x","x","x","x","x","x"]
["55M",3,3,3,3,3,3,3,3,3,3,3,3.7,3.7,3.7,4.8,4.8,4.8,4.8,4.8,4.8,4.8,4.8,4.8,4.8,6,6,6,6,6,6,6,"x","x","x","x","x","x","x","x","x","x","x","x","x","x","x","x","x","x"]
["75M",3.7,3.7,3.7,3.7,3.7,3.7,3.7,3.7,4.8,4.8,4.8,4.8,4.8,4.8,6,6,6,6,6,6,"x","x","x","x","x","x","x","x","x","x","x","x","x","x","x","x","x","x","x","x","x","x","x","x","x","x","x","x","x"]
["8T",2,2,2,2,2,2,2,2,2,2,2,2,2,2,2,2,2,2,2,2,2,2,2,2,2,2,2,2,2,2,2,2,2,2,2,3,3,3,3,3,3,3,3,3,3,3,3,3,3]
["12T",2,2,2,2,2,2,2,2,2,2,2,2,2,2,2,2,2,2,2,2,2,2,2,2,2,2,2,2,2,2,2,2,2,2,2,3,3,3,3,3,3,3,3,3,3,3,3,3,3]
["18T",2,2,2,2,2,2,2,2,2,2,2,2,2,2,2,2,2,2,2,2,2,2,2,2,2,2,2,2,2,2,2,2,2,2,2,3,3,3,3,3,3,3,3,3,3,3,3,3,3]
["23T",2,2,2,2,2,2,2,2,2,2,2,2,2,2,2,2,2,2,2,2,2,2,2,2,2,2,2,2,2,3,3,3,3,3,3,4.4000000000000004,4.4000000000000004,4.4000000000000004,4.4000000000000004,4.4000000000000004,4.4000000000000004,4.4000000000000004,4.4000000000000004,4.4000000000000004,4.4000000000000004,4.4000000000000004,4.4000000000000004,4.4000000000000004,4.4000000000000004]
["30T",2,2,2,2,2,2,2,2,2,2,2,2,2,2,2,3,3,3,3,3,3,3,3,3,3,3,3,3,4.4000000000000004,4.4000000000000004,4.4000000000000004,4.4000000000000004,4.4000000000000004,4.4000000000000004,4.4000000000000004,6,6,6,6,6,6,6,7.7,7.7,7.7,7.7,7.7,7.7,7.7]
["35T",2,2,2,2,2,2,2,2,2,2,2,2,2,2,2,3,3,3,3,3,3,3,3,3,3,3,3,3,4.4000000000000004,4.4000000000000004,4.4000000000000004,4.4000000000000004,4.4000000000000004,4.4000000000000004,4.4000000000000004,6,6,6,6,6,6,6,7.7,7.7,7.7,7.7,7.7,7.7,7.7]
["45T",4.5,4.5,4.5,4.5,4.5,4.5,4.5,4.5,4.5,4.5,4.5,4.5,4.5,4.5,4.5,4.5,4.5,4.5,4.5,4.5,4.4000000000000004,4.4000000000000004,4.4000000000000004,4.4000000000000004,4.4000000000000004,4.4000000000000004,6,6,6,6,6,6,6,6,6,7.7,7.7,7.7,7.7,7.7,7.7,7.7,9.5,9.5,9.5,9.5,9.5,9.5,9.5]
["55T",4.5,4.5,4.5,4.5,4.5,4.5,4.5,4.5,4.5,4.5,4.5,4.5,4.5,4.5,4.5,4.5,4.5,4.5,4.5,4.5,4.4000000000000004,4.4000000000000004,4.4000000000000004,4.4000000000000004,4.4000000000000004,4.4000000000000004,6,6,6,6,6,6,6,6,6,7.7,7.7,7.7,7.7,7.7,7.7,7.7,9.5,9.5,9.5,9.5,9.5,9.5,9.5]
["75T",4.5,4.5,4.5,4.5,4.5,4.5,4.5,4.5,4.5,4.5,4.5,4.5,4.5,4.5,4.5,4.5,6,6,6,6,6,6,6,6,6,6,7.7,7.7,7.7,7.7,7.7,7.7,7.7,7.7,7.7,9.5,9.5,9.5,9.5,9.5,9.5,9.5,12,12,12,12,12,12,12]
["100T",4.5,4.5,4.5,4.5,4.5,4.5,4.5,4.5,6,6,6,6,6,6,6,6,7.5,7.5,7.5,7.5,7.7,7.7,7.7,7.7,9.5,9.5,9.5,9.5,9.5,9.5,9.5,9.5,9.5,9.5,9.5,12,12,12,12,12,12,12,14.7,14.7,14.7,14.7,14.7,14.7,14.7]
["125T",6,6,6,6,6,6,6,6,6,6,7.5,7.5,7.5,7.5,7.5,7.5,7.5,7.5,9.5,9.5,9.5,9.5,9.5,9.5,9.5,9.5,12,12,12,12,12,12,12,12,12,14.7,14.7,14.7,14.7,14.7,14.7,14.7,18.5,18.5,18.5,18.5,18.5,18.5,18.5]
["150T",6,6,6,6,6,6,7.5,7.5,7.5,7.5,7.5,7.5,9.5,9.5,9.5,9.5,9.5,9.5,12,12,12,12,12,12,14.7,14.7,14.7,14.7,14.7,14.7,14.7,14.7,14.7,14.7,14.7,18.5,18.5,18.5,18.5,18.5,18.5,18.5,22.5,22.5,22.5,22.5,22.5,22.5,22.5]
["180T",9.5,9.5,9.5,9.5,9.5,9.5,9.5,9.5,9.5,9.5,9.5,9.5,12,12,12,12,12,12,15,15,14.7,14.7,14.7,14.7,14.7,14.7,18.5,18.5,18.5,18.5,18.5,18.5,18.5,18.5,18.5,"x","x","x","x","x","x"]
["210T",9.5,9.5,9.5,9.5,9.5,9.5,9.5,9.5,12,12,12,12,12,12,15,15,15,15,15,15,18.5,18.5,18.5,18.5,18.5,18.5,18.5,18.5,22.5,22.5,22.5,22.5,22.5,22.5,22.5,"x","x","x","x","x","x"]
["250T",15,15,15,15,15,15,15,15,15,15,15,15,15,15,15,15,18.5,18.5,18.5,18.5,18.5,18.5,22.5,22.5,22.5,22.5,22.5,22.5,30,30,30,30,30,30,30,"x","x","x","x","x","x"]
["300T",12,12,12,12,12,12,15,15,15,15,15,15,18.5,18.5,18.5,18.5,18.5,18.5,22.5,22.5,22.5,22.5,22.5,22.5,30,30,30,30,30,30,30,30,30,30,30,"x","x","x","x","x","x"]
["330T",15,15,15,15,15,15,15,15,15,18.5,18.5,18.5,18.5,18.5,22.5,22.5,22.5,22.5,22.5,22.5,30,30,30,30,30,30,30,30,30,30,30,30,37,37,37,"x","x","x","x","x","x"]
["380T",15,15,15,15,15,15,18.5,18.5,18.5,18.5,22.5,22.5,22.5,22.5,22.5,22.5,30,30,30,30,30,30,30,30,37,37,37,37,37,37,37,37,37,37,37,"x","x","x","x","x","x"]
["440T",18.5,18.5,18.5,18.5,18.5,18.5,18.5,18.5,22.5,22.5,22.5,22.5,22.5,30,30,30,30,30,30,30,30,37,37,37,37,37,37,37,37,45,45,45,45,45,45,"x","x","x","x","x","x"]
["500T",18.5,18.5,18.5,18.5,18.5,18.5,22.5,22.5,22.5,22.5,30,30,30,30,30,30,30,30,37,37,37,37,37,37,45,45,45,45,45,45,60,60,60,60,60,"x","x","x","x","x","x"]
["650T",30,30,30,30,30,30,30,30,30,37,37,37,37,37,45,45,45,45,45,60,60,60,60,60,60,60,60,60,60,75,75,75,75,75,75,"x","x","x","x","x","x"]
[]
[null,"POTENZA CENTRALINA ELETTRONICA kW"]
[null,"PRESSIONE"]
["pompa",12,13,14,15,16,17,18,19,20,21,22,23,24,25,26,27,28,29,30,31,32,33,34,35,36,37,38,39,40,41,42,43,44,45,46,47,48,49,50]
["18T",2,2,2,2,2,2,2,2,2,2,2,2,2,2,2,2,2,2,2,2,2,2,2,2,2,2,2,2,2,2,2,2,2,2,2,3,3,3,3]
["23T",2,2,2,2,2,2,2,2,2,2,2,2,2,2,2,2,2,2,2,2,2,2,2,2,2,2,2,2,2,3,3,3,3,3,3,4.5,4.5,4.5,4.5]
["35T",2,2,2,2,2,2,2,2,2,2,2,2,2,2,2,2,2,3,3,3,3,3,3,3,3,3,3,3,3,3,3,3,3,4.5,4.5,4.5,4.5,4.5,4.5]
["55T",2,2,2,2,2,2,2,3,3,3,3,3,3,3,3,3,3,4.5,4.5,4.5,4.5,4.5,4.5,4.5,4.5,4.5,4.5,4.5,4.5,6,6,6,6,6,6,6,6,6,6]
["75T",3,3,3,3,3,3,3,3,3,3,3,4.5,4.5,4.5,4.5,4.5,4.5,4.5,4.5,4.5,4.5,6,6,6,6,6,6,6,6,6,6,6,6,7.5,7.5,7.5,7.5,7.5,7.5]
["100T",4.5,4.5,4.5,4.5,4.5,4.5,4.5,4.5,4.5,4.5,4.5,6,6,6,6,6,6,6,6,7.5,7.5,7.5,7.5,7.5,7.5,7.5,7.5,9.5,9.5,9.5,9.5,9.5,9.5,9.5,9.5,9.5,9.5,12,12]
["125T",4.5,4.5,4.5,4.5,4.5,6,6,6,6,6,6,6,6,7.5,7.5,7.5,7.5,7.5,7.5,7.5,7.5,9.5,9.5,9.5,9.5,9.5,9.5,9.5,9.5,12,12,12,12,12,12,12,12,12,15]
["150T",6,6,6,7.5,7.5,7.5,7.5,7.5,7.5,7.5,7.5,7.5,7.5,7.5,7.5,9.5,9.5,9.5,9.5,9.5,9.5,12,12,12,12,12,12,12,12,15,15,15,15,15,15,15,15,15,15]
["180T",7.5,7.5,7.5,7.5,7.5,7.5,7.5,7.5,7.5,9.5,9.5,9.5,9.5,9.5,9.5,12,12,12,12,12,12,12,12,15,15,15,15,15,15,15,15,15,15,18.5,18.5,18.5,18.5,18.5,18.5]
["210T",7.5,7.5,7.5,7.5,7.5,9.5,9.5,9.5,9.5,9.5,9.5,12,12,12,12,12,12,15,15,15,15,15,15,15,15,18.5,18.5,18.5,18.5,18.5,18.5,18.5,18.5,18.5,18.5,22.5,22.5,22.5,22.5]
["250T",9.5,9.5,9.5,9.5,9.5,12,12,12,12,12,12,15,15,15,15,15,15,15,15,18.5,18.5,18.5,18.5,18.5,18.5,18.5,18.5,22.5,22.5,22.5,22.5,22.5,22.5,22.5,22.5,22.5,22.5,30,30]
["300T",12,12,12,12,12,12,12,12,12,15,15,15,15,15,15,18.5,18.5,18.5,18.5,18.5,18.5,18.5,18.5,22.5,22.5,22.5,22.5,22.5,22.5,30,30,30,30,30,30,30,30,30,30]
["330T",15,15,15,15,15,15,15,15,15,15,15,18.5,18.5,18.5,18.5,18.5,18.5,22.5,22.5,22.5,22.5,22.5,22.5,30,30,30,30,30,30,30,30,30,30,30,30,30,30,"x","x"]
["380T",15,15,15,15,15,15,15,15,15,18.5,18.5,18.5,18.5,18.5,18.5,22.5,22.5,22.5,22.5,22.5,22.5,30,30,30,30,30,30,30,30,30,30,"x","x","x","x","x","x","x","x"]
[]
[]
[]
[null,"POTENZA CENTRALINA MECCANICA 60Hz kW"]
["60HZ","PRESSIONE"]
["pompa",12,13,14,15,16,17,18,19,20,21,22,23,24,25,26,27,28,29,30,31,32,33,34,35,36,37,38,39,40,41,42,43,44,45,46,47,48,49,50,51,52]
["HL8M","x","x","x","x","x","x","x","x","x","x","x","x","x","x","x","x","x","x","x","x","x","x","x","x","x","x","x","x","x","x","x","x","x","x","x","x","x","x","x","x","x"]
["HL12M","x","x","x","x","x","x","x","x","x","x","x","x","x","x","x","x","x","x","x","x","x","x","x","x","x","x","x","x","x","x","x","x","x","x","x","x","x","x","x","x","x"]
["HL18M","x","x","x","x","x","x","x","x","x","x","x","x","x","x","x","x","x","x","x","x","x","x","x","x","x","x","x","x","x","x","x","x","x","x","x","x","x","x","x","x","x"]
["HL23M","x","x","x","x","x","x","x","x","x","x","x","x","x","x","x","x","x","x","x","x","x","x","x","x","x","x","x","x","x","x","x","x","x","x","x","x","x","x","x","x","x"]
["HL8T","x","x","x","x","x","x","x","x","x","x","x","x","x","x","x","x","x","x","x","x","x","x","x","x","x","x","x","x","x","x","x","x","x","x","x","x","x","x","x","x","x"]
["HL12T","x","x","x","x","x","x","x","x","x","x","x","x","x","x","x","x","x","x","x","x","x","x","x","x","x","x","x","x","x","x","x","x","x","x","x","x","x","x","x","x","x"]
["HL18T","x","x","x","x","x","x","x","x","x","x","x","x","x","x","x","x","x","x","x","x","x","x","x","x","x","x","x","x","x","x","x","x","x","x","x","x","x","x","x","x","x"]
["HL23T","x","x","x","x","x","x","x","x","x","x","x","x","x","x","x","x","x","x","x","x","x","x","x","x","x","x","x","x","x","x","x","x","x","x","x","x","x","x","x","x","x"]
["HL12MD","x","x","x","x","x","x","x","x","x","x","x","x","x","x","x","x","x","x","x","x","x","x","x","x","x","x","x","x","x","x","x","x","x","x","x","x","x","x","x","x","x"]
["HL18MD","x","x","x","x","x","x","x","x","x","x","x","x","x","x","x","x","x","x","x","x","x","x","x","x","x","x","x","x","x","x","x","x","x","x","x","x","x","x","x","x","x"]
["HL23MD","x","x","x","x","x","x","x","x","x","x","x","x","x","x","x","x","x","x","x","x","x","x","x","x","x","x","x","x","x","x","x","x","x","x","x","x","x","x","x","x","x"]
["HL30MD","x","x","x","x","x","x","x","x","x","x","x","x","x","x","x","x","x","x","x","x","x","x","x","x","x","x","x","x","x","x","x","x","x","x","x","x","x","x","x","x","x"]
["HL12TD","x","x","x","x","x","x","x","x","x","x","x","x","x","x","x","x","x","x","x","x","x","x","x","x","x","x","x","x","x","x","x","x","x","x","x","x","x","x","x","x","x"]
["HL18TD","x","x","x","x","x","x","x","x","x","x","x","x","x","x","x","x","x","x","x","x","x","x","x","x","x","x","x","x","x","x","x","x","x","x","x","x","x","x","x","x","x"]
["HL23TD","x","x","x","x","x","x","x","x","x","x","x","x","x","x","x","x","x","x","x","x","x","x","x","x","x","x","x","x","x","x","x","x","x","x","x","x","x","x","x","x","x"]
["HL30TD","x","x","x","x","x","x","x","x","x","x","x","x","x","x","x","x","x","x","x","x","x","x","x","x","x","x","x","x","x","x","x","x","x","x","x","x","x","x","x","x","x"]
["8M","x","x","x","x",2.6,2.6,2.6,2.6,2.6,2.6,2.6,2.6,2.6,2.6,2.6,2.6,2.6,2.6,2.6,2.6,2.6,2.6,2.6,2.6,2.6,2.6,2.6,2.6,3.7,3.7,3.7,3.7,3.7,3.7,3.7,3.7,3.7,3.7,3.7,3.7,3.7]
["12M","x","x","x","x",2.6,2.6,2.6,2.6,2.6,2.6,2.6,2.6,2.6,2.6,2.6,2.6,2.6,2.6,2.6,2.6,2.6,2.6,2.6,2.6,2.6,2.6,2.6,2.6,3.7,3.7,3.7,3.7,3.7,3.7,3.7,3.7,3.7,3.7,3.7,3.7,3.7]
["18M","x","x","x","x",2.6,2.6,2.6,2.6,2.6,2.6,2.6,2.6,2.6,2.6,2.6,2.6,2.6,2.6,2.6,2.6,2.6,2.6,2.6,2.6,2.6,2.6,2.6,2.6,3.7,3.7,3.7,3.7,3.7,3.7,3.7,3.7,3.7,3.7,3.7,3.7,3.7]
["23M","x","x","x","x",2.6,2.6,2.6,2.6,2.6,2.6,2.6,2.6,2.6,2.6,3.7,3.7,3.7,3.7,3.7,3.7,3.7,3.7,3.7,3.7,3.7,3.7,3.7,3.7,3.7,3.7,3.7,3.7,3.7,3.7,3.7,3.7,3.7,3.7,3.7,3.7,3]
["30M","x","x","x","x",3.7,3.7,3.7,3.7,3.7,3.7,3.7,3.7,3.7,3.7,3.7,4.4000000000000004,4.4000000000000004,4.4000000000000004,4.4000000000000004,4.4000000000000004,4.4000000000000004,4.4000000000000004,4.4000000000000004,4.4000000000000004,4.4000000000000004,4.4000000000000004,4.4000000000000004,6,6,6,6,6,6,6,6,6,6,6,6,6,6]
["35M","x","x","x","x",3.7,3.7,3.7,3.7,3.7,3.7,3.7,3.7,3.7,3.7,3.7,4.4000000000000004,4.4000000000000004,4.4000000000000004,4.4000000000000004,4.4000000000000004,4.4000000000000004,4.4000000000000004,4.4000000000000004,4.4000000000000004,4.4000000000000004,4.4000000000000004,4.4000000000000004,6,6,6,6,6,6,6,6,6,6,6,6,6,6]
["45M","x","x","x","x",4.4000000000000004,4.4000000000000004,4.4000000000000004,4.4000000000000004,4.4000000000000004,4.4000000000000004,4.4000000000000004,4.4000000000000004,4.4000000000000004,4.4000000000000004,6,6,6,6,6,6,6,6,6,6,6,6,6,6,6,6,6,7.4,7.4,7.4,7.4,7.4,7.4,7.4,7.4,7.4,7.4]
["55M","x","x","x","x",4.4000000000000004,4.4000000000000004,4.4000000000000004,4.4000000000000004,4.4000000000000004,4.4000000000000004,4.4000000000000004,4.4000000000000004,4.4000000000000004,4.4000000000000004,6,6,6,6,6,6,6,6,6,6,6,6,6,6,6,6,6,7.4,7.4,7.4,7.4,7.4,7.4,7.4,7.4,7.4,7.4]
["75M","x","x","x","x",6,6,6,6,6,6,6,6,6,6,7.4,7.4,7.4,7.4,7.4,7.4,"x","x","x","x","x","x","x","x","x","x","x","x","x","x","x","x","x","x","x","x","x"]
["8T","x","x","x","x",2.2000000000000002,2.2000000000000002,2.2000000000000002,2.2000000000000002,2.2000000000000002,2.2000000000000002,2.2000000000000002,2.2000000000000002,2.2000000000000002,2.2000000000000002,2.2000000000000002,2.2000000000000002,2.2000000000000002,2.2000000000000002,2.2000000000000002,2.2000000000000002,2.2000000000000002,2.2000000000000002,2.2000000000000002,2.2000000000000002,2.2000000000000002,2.2000000000000002,2.2000000000000002,2.2000000000000002,2.2000000000000002,2.2000000000000002,2.2000000000000002,2.2000000000000002,2.2000000000000002,2.2000000000000002,2.2000000000000002,2.2000000000000002,2.2000000000000002,2.2000000000000002,2.2000000000000002,2.2000000000000002,2.2000000000000002]
["12T","x","x","x","x",2.2000000000000002,2.2000000000000002,2.2000000000000002,2.2000000000000002,2.2000000000000002,2.2000000000000002,2.2000000000000002,2.2000000000000002,2.2000000000000002,2.2000000000000002,2.2000000000000002,2.2000000000000002,2.2000000000000002,2.2000000000000002,2.2000000000000002,2.2000000000000002,2.2000000000000002,2.2000000000000002,2.2000000000000002,2.2000000000000002,2.2000000000000002,2.2000000000000002,2.2000000000000002,2.2000000000000002,2.2000000000000002,2.2000000000000002,2.2000000000000002,2.2000000000000002,2.2000000000000002,2.2000000000000002,2.2000000000000002,3,3,3,3,3,3]
["18T","x","x","x","x",2.2000000000000002,2.2000000000000002,2.2000000000000002,2.2000000000000002,2.2000000000000002,2.2000000000000002,2.2000000000000002,2.2000000000000002,2.2000000000000002,2.2000000000000002,2.2000000000000002,2.2000000000000002,2.2000000000000002,2.2000000000000002,2.2000000000000002,2.2000000000000002,2.2000000000000002,2.2000000000000002,2.2000000000000002,2.2000000000000002,2.2000000000000002,2.2000000000000002,2.2000000000000002,2.2000000000000002,2.2000000000000002,2.2000000000000002,2.2000000000000002,2.2000000000000002,2.2000000000000002,2.2000000000000002,2.2000000000000002,3,3,3,3,3,3]
["23T","x","x","x","x",2.2000000000000002,2.2000000000000002,2.2000000000000002,2.2000000000000002,2.2000000000000002,2.2000000000000002,2.2000000000000002,2.2000000000000002,2.2000000000000002,2.2000000000000002,2.2000000000000002,2.2000000000000002,2.2000000000000002,2.2000000000000002,2.2000000000000002,2.2000000000000002,2.2000000000000002,2.2000000000000002,2.2000000000000002,2.2000000000000002,2.2000000000000002,2.2000000000000002,2.2000000000000002,2.2000000000000002,2.2000000000000002,3,3,3,3,3,3,3,3,3,3,3,3]
["30T","x","x","x","x",3,3,3,3,3,3,3,3,3,3,3,3.7,3.7,3.7,3.7,3.7,3.7,3.7,3.7,3.7,3.7,3.7,3.7,3.7,5.3,5.3,5.3,5.3,5.3,5.3,5.3,7.3,7.3,7.3,7.3,7.3,7.3]
["35T","x","x","x","x",3,3,3,3,3,3,3,3,3,3,3,3.7,3.7,3.7,3.7,3.7,3.7,3.7,3.7,3.7,3.7,3.7,3.7,3.7,5.3,5.3,5.3,5.3,5.3,5.3,5.3,7.3,7.3,7.3,7.3,7.3,7.3]
["45T",3.7,3.7,3.7,3.7,3.7,3.7,3.7,3.7,3.7,3.7,3.7,3.7,3.7,3.7,5.3,5.3,5.3,5.3,5.3,5.3,5.3,5.3,5.3,5.3,5.3,5.3,7.3,7.3,7.3,7.3,7.3,7.3,7.3,7.3,7.3,9.1999999999999993,9.1999999999999993,9.1999999999999993,9.1999999999999993,9.1999999999999993,9.1999999999999993]
["55T",3.7,3.7,3.7,3.7,3.7,3.7,3.7,3.7,3.7,3.7,3.7,3.7,3.7,3.7,5.3,5.3,5.3,5.3,5.3,5.3,5.3,5.3,5.3,5.3,5.3,5.3,7.3,7.3,7.3,7.3,7.3,7.3,7.3,7.3,7.3,9.1999999999999993,9.1999999999999993,9.1999999999999993,9.1999999999999993,9.1999999999999993,9.1999999999999993]
["75T",5.3,5.3,5.3,5.3,5.3,5.3,5.3,5.3,5.3,5.3,5.3,5.3,5.3,5.3,5.3,7.3,7.3,7.3,7.3,7.3,7.3,7.3,7.3,7.3,7.3,7.3,9.1999999999999993,9.1999999999999993,9.1999999999999993,9.1999999999999993,9.1999999999999993,9.1999999999999993,9.1999999999999993,9.1999999999999993,9.1999999999999993,11,11,11,11,11,11]
["100T",5.3,5.3,5.3,5.3,5.3,5.3,5.3,5.3,7.3,7.3,7.3,7.3,7.3,7.3,7.3,7.3,9.1999999999999993,9.1999999999999993,9.1999999999999993,9.1999999999999993,9.1999999999999993,9.1999999999999993,9.1999999999999993,9.1999999999999993,11,11,11,11,11,11,11,13.2,13.2,13.2,13.2,13.2,13.2,13.2,13.2,13.2,13.2]
["125T",5.3,5.3,5.3,5.3,7.3,7.3,7.3,7.3,7.3,7.3,9.1999999999999993,9.1999999999999993,9.1999999999999993,9.1999999999999993,9.1999999999999993,9.1999999999999993,9.1999999999999993,9.1999999999999993,11,11,11,11,11,11,11,11,13.2,13.2,13.2,13.2,13.2,13.2,13.2,15,15,15,15,15,15,15,15]
["150T",9.5,9.5,9.5,9.5,9.5,9.5,9.5,9.5,9.1999999999999993,9.1999999999999993,9.1999999999999993,9.1999999999999993,11,11,11,11,11,11,13.2,13.2,13.2,13.2,13.2,13.2,13.2,13.2,13.2,13.2,13.2,15,15,15,15,15,15,18.5,18.5,18.5,18.5,18.5,18.5]
["180T",9.5,9.5,9.5,9.5,9.5,9.5,9.5,9.5,11,11,11,11,13.2,13.2,15,15,15,15,15,15,15,15,15,18.5,18.5,18.5,18.5,18.5,18.5,18.5,24,24,24,24,24,24,24,24,24,24,24]
["210T",15,15,15,15,15,15,15,15,13.2,13.2,13.2,13.2,13.2,13.2,13.2,18.5,18.5,18.5,18.5,18.5,18.5,18.5,18.5,18.5,18.5,18.5,18.5,18.5,24,24,24,24,24,24,29,29,29,29,29,29,29]
["250T",15,15,15,15,15,15,15,15,13.2,13.2,13.2,18.5,18.5,18.5,18.5,18.5,24,24,24,24,24,24,29,29,29,29,29,29,37,37,37,37,37,37,37,48,48,48,48,48,48]
["300T",18.5,18.5,18.5,18.5,18.5,18.5,18.5,18.5,18.5,18.5,18.5,18.5,22.5,22.5,24,24,24,24,29,29,29,29,29,29,37,37,37,37,37,37,37,37,37,37,37,48,48,48,48,48,48]
["330T",15,15,18.5,18.5,18.5,18.5,18.5,18.5,18.5,22.5,22.5,22.5,22.5,22.5,29,29,29,29,29,29,37,37,37,37,37,37,37,37,37,37,37,37,48,48,48,48,48,48,48,48,48]
["380T",18.5,18.5,18.5,18.5,18.5,18.5,22.5,22.5,22.5,22.5,30,30,30,30,29,29,37,37,37,37,37,37,37,37,48,48,48,48,48,48,48,48,48,48,48,57,57,57,57,57,57]
["440T",22.5,22.5,22.5,22.5,22.5,22.5,22.5,22.5,30,30,30,30,30,37,37,37,37,37,37,37,37,48,48,48,48,48,48,48,48,57,57,57,57,57,57,"x","x","x","x","x","x"]
["500T",22.5,22.5,22.5,22.5,22.5,22.5,30,30,30,30,37,37,37,37,37,37,37,37,48,48,48,48,48,48,57,57,57,57,57,57,57,57,57,57,57,"x","x","x","x","x","x"]
["650T",30,30,30,30,30,30,30,30,30,37,37,37,37,37,48,48,48,48,48,57,57,57,57,57,57,57,57,57,57,72,72,72,72,72,72,"x","x","x","x","x","x"]

{"sheet":"lingue","index":16,"n_rows":365,"n_cols":5,"rows_kept":365,"cut":false,"hidden":false,"merged":[[318,4,318,9],[319,4,319,9],[320,4,320,9],[360,4,360,9]]}
["Italiano","Italiano ","English","Deutsch","Español"]
["English","Progetto Pistone modello (9130; 9140; 9150;MCS;MCE)","Ram type (9130; 9140; 9150;MCS;MCE)","Heberbezeichnung (9130; 9140; 9150;MCS;MCE)","Modelo Piston (9130;9140;9150;MCS;MCE)"]
["Deutsch","Coefficiente di taglia                                                                                        ","Rope acting (2) direct acting (1)","Aufhängung","Suspension (2 2:1) (1 1:1)"]
["Español","Portata utile                                                                                                             ","Load","Nennlast","Carga"]
[null,"Massa della cabina e degli organi ad essa collegati   ","car and sling weight","Farhkorbgewicht","Peso de la cabina y chasis"]
[null,"Massa delle funi lato cabina                          ","ropes weight (car side)","Gewicht Seil","Peso de los cables lado cabina"]
[null,"Massa delle funi lato cabina (per pistone)","ropes weight (car side, per piston)","Gewicht Seil","Peso de los cables por piston"]
[null,"Massa di puleggia e arcatina","pulley weight","Gewicht Rolle","Peso de la polea"]
[null,"Massa di puleggia e arcatina (per pistone)","pulley weight (per piston)","Gewicht Rolle","Peso de la polea por pistón"]
[null,"Numero dei pistoni                                    ","number of rams","Anzahl Kolben","Número de pistones."]
[null,"Pistone diviso in 1,2,3 pezzo/i                        ","ram diveded into 1,2,3 pieces","Kolben geteilt in 1,2,3 teile","Pistón dividido en 1,2,3 piezas"]
[null,"corsa impianto","car stroke","Förderhöhe","Recorrido de la cabina"]
[null,"extracorsa pistone","rod extrastroke","Reversehub Kolben","Extrarrecorrido  del piston"]
[null,"extracorsa impianto","car extrastroke","Reservehub Kabine","Extrarrecorrido  de la cabina"]
[null,"corsa minima","minimum rod length","min. Kolbenlänge","Recorrido minimo"]
[null,"dispositivo stelo guidato (si=2)","guided ram device (yes=2)","mit Führung (ja=2)","Dispositivo de guiado (si=2)"]
[null,"Distanza tra asse puleggia e sommità stelo            ","distance between rod and pulley axe","Distanz zwischen Kolben und Rolle","Distancia entre piston y eje polea"]
[null,"Corsa totale pistone                           ","rod stroke","Kolbenhub","Longitud total de la varilla."]
[null,"lunghezza totale pistone chiuso","closed piston length","Kolbenlänge","Longitud del pistón cerrado."]
[null,"Lunghezza di libera inflessione","buckling length",null,"Longitud libre de inflexión"]
[null,"diametro stelo ","rod diameter","Kolbendurchmesser","Diametro varilla"]
[null,"spessore stelo","rod thickness","Wandstärke","Espesor varilla"]
[null,"anello di protezione stelo","rod protection ring",null,"Proteccion "]
[null,"SÌ","YES",null,"SI"]
[null,"a pieno carico     T=gn/10*[cm*(Q+P3)/Nr+Pf+Prh]","Full load  T=gn/10*[cm*(Q+P3)/Nr+Pf+Prh]","Vollast","Plena carga"]
[null,"a cabina vuota    Tv=gn/10*[cm*P3/Nr+Pf+Prh]","empty load    Tv=gn/10*[cm*P3/Nr+Pf+Prh]","Min. Gewicht","En vacio"]
[null,"carico punta","buckling load",null,"Carga en punta efectiva"]
[null,"carico ammissibile","alloable buckling load",null,"Carga máxima admisible"]
[null,"Coeff. di sicurezza","safety coeff.",null,"Coeficiente de seguridad"]
[null,"Pres. stat. a pieno carico (T+Pr*gn/10)/A+(y*H/10) ","Max. Pressure","Max. Druck","Presion MAX."]
[null,"Pres. stat. a vuoto          (Tv+Pr*gn/10)/A+(y*H/10)   ","Min. pressure","min. Druck","Presion MIN."]
[null,"Progetto Centralina","Power unit","Aggregat","Potencia motor"]
[null,"Numero di centraline","No. power units","Anzahl Aggregate","Número de centrales"]
[null,"pompa","pump","Pumpe","Bomba"]
[null,"ascensore (Lift) o piattaforma (HL)","Lift or platform (HL)",null,"Ascensor o HomeLift (Siempre LIFT nuestros HOMELIFT)"]
[null,"motore monofase (M); trifase ( T )","motor monophase (M); 3-phase ( T )","Motor","Motor Monofase (M) Trifase (T)"]
[null,"motore in Olio (O) o in Aria (A) (solo per centraline HL)","motor in Oil (O) or in Air (A) (only HL)","Motor in Öl (O) oder ausserhalb (A)","Sumergido (O) Aereo (A) HL MORIS"]
[null,"1 o 2 velocità (solo per centraline HL)","single (1) or double (2) speed (only HL)",null,"1V (1) 2V(2) solo HL"]
[null,"CIF - centralina in fossa (da 55 a 250 l/min)","CIF option (power unit in the pit, 55 to 250 l/min)",null,"CIF - central en foso ( 55 a 250 l/min)"]
[null,"valvola standard (STD) o elettronica \"MB\" (ELE)","standard (STD) or electronic-\"MB\" (ELE) valve",null,"Valvula Estándar (STD) Electronica (ELE)"]
[null,"singolo (S) o doppio (D) riempimento","single (S) or double (D) fill",null,"simple (S) o doble (D) relleno"]
[null,"tensione elettrovalvole","coil voltage",null,"Tensión bobinas"]
[null,"tensione discesa emergenza su EB","emergency voltage requested on EB coil",null,"Tensión bobina emergencia"]
[null,"valvola elettronica: dato non necessario","electronic valve: coil voltage not required",null,"Válvula electrónica dato no necesario"]
[null,"valvola standard: dato non necessario","standard valve: board voltage not required",null,"Válvula estándar dato no necesario"]
[null,"tensione alim. scheda DELCON-C","DELCON-C supply voltage",null,"Tension DELCON-C"]
[null,"Velocità effettiva pistone","real rod speed","Kolbengeschwindigkeit","Velocidad  pistón"]
[null,"Velocità effettiva impianto","real plant speed","Fahrkorbgeschwindigkeit","Velocidad cabina"]
[null,"Potenza","power   ","Motorleistung","Potencia motor"]
[null,"olio totale nel pistone","oil in jack","Benötigte Ölmenge im Kolben","Aceite total en piston"]
[null,"olio in circolo (olio corsa)","circulating oil","Benötigte Betriebsölmenge","Aceite en circulación"]
[null,"Centralina modello","power unit type","Aggregat typ","Modelo de central"]
[null,"Stelo","ram","Kolben","Piston"]
[null,"diviso in pezzi","in pieces","geteilt in","Por piezas"]
[null,"Centralina","Power unit","Aggregat","Central"]
[null,"velocità","speed","Geschwindigkeit","Modelo central"]
[null,"pressione","pressure","Druck","Presion"]
[null,"sconto","discount","Rabatt","Descuento"]
[null,"prezzo","Price","Preis","Precio"]
[]
[null,"Quantità","Quantity","Stück","Cantidad"]
[null,"prezzo","price","Preis","Precio"]
["5438 / P","barra tubo mandata  ø 35 x 2,5 (m 6)","Steel pipe  ø 35 x 2,5 (m 6)","Rohr  ø 35 x 2,5 (m 6)","barra tubo mandata  ø 35 x 2,5 (m 6)"]
["5439 / P","barra tubo mandata  ø 42 x  3   (m 6)","Steel pipe  ø 42 x  3   (m 6)","Rohr  ø 42 x  3   (m 6)","barra tubo mandata  ø 42 x  3   (m 6)"]
["KIT.RACC/VER28","raccordo a 90 °  ø 28 uscita verticale da centralina","Elbow connection 90 °  ø 28 vertical exit power unit","Elbow connection 90 °  ø 28 vertical exit power unit","Racor a 90º  ø 28 salida vertical en central"]
["KIT.RACC/VER35","raccordo a 90 °  ø 35 uscita verticale da centralina","Elbow connection 90 °  ø 35 vertical exit power unit","Elbow connection 90 °  ø 35 vertical exit power unit","Racor a 90º  ø 35 salida vertical en central"]
["KIT.RACC/VER42","raccordo a 90 °  ø 42 uscita verticale da centralina","Elbow connection 90 °  ø 42 vertical exit power unit","Elbow connection 90 °  ø 42 vertical exit power unit","Racor a 90º  ø 42 salida vertical en central"]
["KIT.RACC/ORR35","raccordo a 90 °  ø 35 uscita orizzontale da centralina","Elbow connection 90 °  ø 35 horizontal exit power unit","Elbow connection 90 °  ø 35 vertical exit power unit","Racor a 90º  ø 35 salida horizontal en central"]
["KIT.RACC/ORR42","raccordo a 90 °  ø 42 uscita orizzontale da centralina","Elbow connection 90 °  ø 42 horizontal exit power unit","Elbow connection 90 °  ø 42 vertical exit power unit","Racor a 90º  ø 42 salida horizontal en central"]
[5308,"raccordo di giunzione diritto ø 35","Straight connection  ø 35","Direkte Verbindung ø 35","Racor de conexión directo  ø 35"]
[5309,"raccordo di giunzione diritto ø 42","Straight connection  ø 42","Direkte Verbindung ø 42","Racor de conexión directo  ø 42"]
[5310,"raccordo di giunzione  a 90 °  ø 35","Elbow connection 90 °  ø 35","90° Winkelverbindung ø 35","Racor de conexion directo  ø 35"]
[5311,"raccordo di giunzione  a 90 °  ø 42","Elbow connection 90 °  ø 42","90° Winkelverbindung ø 42","Racor de conexión a 90º  ø 42"]
[5316,"raccordo 3 vie a ‘T’   1\" ¼ ","3 way T connection  1\" ¼ ","T-Verteiler 1\"1/4","Conexión 3 vias ‘T’   1\" ¼ "]
["RACC.T42+2/35","raccordo 3 vie  a ‘T’  1\" ½ x 1\" ¼ x 1\" ¼ ","3 way T connection  1\" ½  x 1\" ¼  x 1\" ¼","T-Verteiler 1\"1/2x1\"1/4x1\"1/4","Conexión 3 vias  a ‘T’  1\" ½ x 1\" ¼ x 1\" ¼ "]
[5317,"raccordo 3 vie a ‘T’  1\" ½ ","3 way T connection  1\" ½","T-Verteiler 1\"1/2","Conexión 3 vias‘T’  1\" ½ "]
["0696/2","raccordo 3 vie  a ‘Y’  1\" ½ x 1\" ¼ x 1\" ¼ ","3 way Y connection  1\" ½ x  1\" ¼ x 1\" ¼","Y-Verteiler 1\"1/2x1\"1/4x1\"1/4","Conexión 3 vias  a ‘Y’  1\" ½ x 1\" ¼ x 1\" ¼ "]
["0696/1","raccordo 3 vie a ‘Y’  1\" ½ ","3 way Y connection  1\" ½ ","Y-Verteiler 1\"1/2","Conexión 3 vias‘Y’  1\" ½ "]
["0696","raccordo 3 vie  a ‘Y’  2\" x 1\" ½  x 1\" ½ ","3 way Y connection  2\" x 1\" ½  x 1\" ½","Y-Verteiler 2\"x1\"1/2x1\"1/2","Conexión 3 vias  a ‘Y’  2\" x 1\" ½  x 1\" ½ "]
["0696/3","raccordo 3 vie a ‘Y’  2\" ","3 way Y connection  2\" ","Y-Verteiler 2\"","Conexión 3 vias‘Y’  2\" "]
[5306,"nipplo 1\"1/4 per raccordo a tre vie a Y","Nipplo 1\"1/4 for 3 way Y connection ","Nippel 1\"1/4 für Y verteiler","Racor 1\"1/4 para conexion a tres vias a Y"]
[5307,"nipplo 1\"1/2 per raccordo a tre vie a Y","Nipplo 1\"1/2 for 3 way Y connection ","Nippel 1\"1/2 für Y verteiler","Racor 1\"1/2 para conexion a tres vias a Y"]
[5325,"nipplo 2\" per raccordo a tre vie a Y","Nipplo 2\" for 3 way Y connection ","Nippel 2'' für Y verteiler","Racor 2\" para conexion a tres vias a Y"]
[5425,"tubo miniflex per collegamento valvole paracadute  ø 8  - m 5","Hose to balance rupture valve  ø 8  - m 5","Schlauch für Druckausgleich der Rohrbruchventile","tubo miniflex para  valvula paracaidas  ø 8  -5 m "]
["RACC.90/VP-MF","raccordi per tubo miniflex-valvola di blocco  serie di due","Connection between hose and rupture valve (2 pieces)","Verbindung zwischen Schlauch und Rohrbruchventil (2 teilig)","Conexión tubo miniflex-valvula paracaidas 2 piezas"]
["5307/5","raccordo intermedio per tubo miniflex ø 8","Connection between 2 hoses ø 8  - m 5","Verbindung zwischen 2 Schlauchen","Conexión intermedia tubo miniflex ø 8"]
[5426,"metri di tubo in rame per collegamento valvole di blocco","copper tube for connection between rupture valve",null,"Metro de tubo para conexión valvula paracaidas"]
["5307/3","raccordo intermedio per tubo rame ","connection for copper tube 5426",null,"Conexión intermedia para tubo cobre 5426"]
["5311/5","serie di 2 raccordi per collegamento tubo rame-valvola di blocco","connection between copper tube and rupture valve",null,"Conexión entre tubo de cobre y valvula paracaidas"]
["5320/COMPLETO","riduzione valvola di blocco 1\"1/2-1\"1/4 lato tubo","reduction rupture valve 1\"1/2-1\"1/4 side hose",null,"riduzione valvola di blocco 1\"1/2-1\"1/4 lato tubo"]
[0,"tuboflex 3/4 \" diritto-90°","Flexible hose 3/4 \" straight-90°","Schlauch 3 / 4 \"  ","tuboflex 3/4 \" diritto-90°"]
[0,"tuboflex 3/4 \" diritto-diritto","Flexible hose 3/4 \" straight-straight","Schlauch 3 / 4 \" ","tuboflex 3/4 \" diritto-diritto"]
[0,"tuboflex 1\" diritto-90°","Flexible hose 1” straight-90°","Schlauch 1”  direkt –90°","tuboflex 1\" diritto-90°"]
[0,"tuboflex 1\" diritto-diritto","Flexible hose 1” straight-straight","Schlauch 1” direkt-direkt","tuboflex 1\" diritto-diritto"]
[0,"tuboflex 1\" 1/4 diritto-90°","Flexible hose 1” 1/4 straight-90°","Schlauch 1” 1 / 4  direkt –90°","tuboflex 1\" 1/4 diritto-90°"]
[0,"tuboflex 1\" 1/4 diritto-diritto","Flexible hose 1” 1/4 straight-straight","Schlauch 1” 1 / 4  direkt – direkt","tuboflex 1\" 1/4 diritto-diritto"]
[0,"tuboflex 1\" 1/2 diritto-90°","Flexible hose 1” 1/2 straight-90°","Schlauch 1” 1 / 2   direkt –90°","tuboflex 1\" 1/2 diritto-90°"]
[0,"tuboflex 1\" 1/2 diritto-diritto","Flexible hose 1” 1/2 straight-straight","Schlauch 1” 1 / 2 direkt - direkt","tuboflex 1\" 1/2 diritto-diritto"]
[0,"tuboflex 2\" diritto-diritto","Flexible hose 2” straight-straight","Schlauch 2”  ","tuboflex 2\" diritto-diritto"]
[0,"tuboflex 2\" diritto-diritto","Flexible hose 2” straight-straight","Schlauch 2”  ","tuboflex 2\" diritto-diritto"]
["STAF.TUB.35","staffa fissaggio per tubiflex ¾\", 1\" e barre tubo ø 35","Fixation for hoses ¾\", 1\" and steel pipes ø 35","Rohrschelle  ø 35 oder Schlauchschelle 1\"","staffa fissaggio per tubiflex ¾\", 1\" e barre tubo ø 35"]
["STAF.TUB.42","staffa fissaggio per barre tubo ø 42","Fixation for steel pipe  ø 42","Rohrschelle  ø 42","staffa fissaggio per barre tubo ø 42"]
["STAF.TU.1\"1/4","staffa fissaggio per tuboflex 1\" ¼","Fixation for rubber hose 1\" ¼","Schlauchschelle 3/4\" - 1\"1/4","staffa fissaggio per tuboflex 1\" ¼"]
["STAF.TU.1\"1/2","staffa fissaggio per tuboflex 1\" ½","Fixation for rubber hose 1\" ½","Schlauchschelle 1\"1/2","staffa fissaggio per tuboflex 1\" ½"]
["STAF.TU.2\"G","staffa fissaggio per tuboflex  2\"","Fixation for rubber pipe 2\"","Schlauchschelle 2\"","staffa fissaggio per tuboflex  2\""]
["FAS/FLEX 1\"1/4","staffa speciale fissaggio per tuboflex  1\" ¼ ","Bracket - hose 1\" 1/4","Bracket - hose 1\" 1/4","staffa speciale fissaggio per tuboflex  1\" ¼ "]
["FAS/FLEX 1\"1/2","staffa speciale fissaggio per tuboflex  1\" ½ ","Bracket - hose 1\" 1/2","Bracket - hose 1\" 1/2","staffa speciale fissaggio per tuboflex  1\" ½ "]
["FAS/FLEX 2\"","staffa speciale fissaggio per tuboflex  2\" ","Bracket - hose 2\"","Bracket - hose 2\"","staffa speciale fissaggio per tuboflex  2\" "]
["0384/0-P","vite spurgo aria per pistone","Purge screw for air inside the ram",null,"vite spurgo aria per pistone"]
[5332,"raccordo per tubo recupero olio","Connection for oil recover pipe",null,"raccordo per tubo recupero olio"]
[5419,"tubo recupero olio (al metro)","Oil recover pipe 1 meter",null,"tubo recupero olio (al metro)"]
[745,"coppia staffe per avvitamento pistone in due pezzi da ø 70 a ø 120","Tie kit to screw ram in 2 pieces from ø 70 to ø 120",null,"coppia staffe per avvitamento pistone in due pezzi da ø 70 a ø 120"]
[747,"coppia staffe per avvitamento pistone in due pezzi da ø 130 a ø 200","Tie kit to screw ram in 2 pieces from ø 130 to ø 200",null,"coppia staffe per avvitamento pistone in due pezzi da ø 130 a ø 200"]
["5256/5","carta catramata – rotolo lungh. 10 m largh. 10 cm per pistoni interrati","Roll of Tar paper, length 10 m width 10 cm for underground pistons",null,"carta catramata – rotolo lungh. 10 m largh. 10 cm per pistoni interrati"]
["0884/CM3-A-SC","armadio da assemblare su centralina CM-320/A","Roomless Box to be assembled on tank CM-320/A",null,"armadio da assemblare su centralina CM-320/A"]
["0884/CMVM02A","armadio – MI 2000-CM3 smontato – per CM-320 colore RAL 7035","Roomless Box MI-2000 for CM-320 not assembled color RAL 7035",null,"armadio – MI 2000-CM3 smontato – per CM-320 colore RAL 7035"]
["0884/CMVM02A","armadio – MI 2000 – per CM-320/A colore RAL 7035","Roomless Box MI-2000 for CM-320/A color RAL 7035",null,"armadio – MI 2000 – per CM-320/A colore RAL 7035"]
["0884/CM3VM02A","armadio – MI 2000 CM – per CM colore RAL 7035","Roomless Box MI-2000 for CM color RAL 7035",null,"armadio – MI 2000 CM – per CM colore RAL 7035"]
["0884/CAVM02A","armadio – MI 2000 CA– per CA colore Ral 7035","Roomless Box MI-2000 for CA color RAL 7035",null,"armadio – MI 2000 CA– per CA colore Ral 7035"]
["5123/6","loctite 5900 per mi-2000","Loctite 5900 (for Box MI-2000)",null,"loctite 5900 per mi-2000"]
["SCAMB.5/10M-3","scambiatore di calore modello scamb. 5/10 con 2 tubi da mt. 3","Heat exchanger SCAMB. 5/10 with 2 rubber pipe 3 m","Kühler SCAMB 5/10 mit Schlauch 3m","Intercambiador de calor  scamb. 5/10 con 2 tubi da mt. 3"]
["SCAMB.20M-3","scambiatore di calore modello scamb. 20  con 2  tubi da mt. 3","Heat exchanger SCAMB. 20   with 2 rubber pipe 3m","Kühler SCAMB 20 mit Schlauch 3m","Intercambiador de calor  scamb. 20  con 2  tubi da mt. 3"]
["SCAMB.30M-3","scambiatore di calore modello scamb. 30 con 2 tubi da mt. 3","Heat exchanger SCAMB. 30 with 2 rubber pipe 3m","Kühler SCAMB 30 mit Schlauch 3m","Intercambiador de calor  scamb. 30 con 2 tubi da mt. 3"]
[null,"scambiatore di calore scamb.5/10 con pannello di controllo e 2 tubi mt. 3","Heat exchanger SCAMB. 5/10 with electrical control panel, 2 rubber pipe 3m",null,"Intercambiador de calor scamb.5/10 con pannello di controllo e 2 tubi mt. 3"]
["Scase 20","scambiatore di calore scamb.20 con pannello di controllo e 2 tubi mt. 3","Heat exchanger SCAMB. 20 with electrical control panel, 2 rubber pipe 3m",null,"Intercambiador de calor scamb.20 con pannello di controllo e 2 tubi mt. 3"]
["Scase 30","scambiatore di calore scamb.30 con pannello di controllo e 2 tubi mt. 3","Heat exchanger SCAMB. 30 with electrical control panel, 2 rubber pipe 3m",null,"Intercambiador de calor scamb.30 con pannello di controllo e 2 tubi mt. 3"]
["SCHEDA EL (PR)","scheda elettronica mi – 0816","Electric card MI – 0816",null,"Placa electrónica mi – 0816"]
["MICR.COM20/3","pompa di microlivellamento in salita 20 l/min - 3 hp ","up-direction micro levelling pump, 20 l/min - 3 HP ",null,"Bomba de micronivelación 20 l/min - 3 CV"]
[null,"Documentazione tecnica (calcoli pistone) per verifica ispettiva","Technical documentation (jack calculation) for final inspection",null,"Documentación técnica (cálculo piston) para verificación por inspector"]
[null,"tastierino di programmazione per valvola elettronica","Programming keyboard for Electronic power unit",null,"Consola programación central electrónica"]
[null,"Prezzo lordo accessori","Price List","Listenpreis","Precio"]
[null,"Prezzo netto accessori","Net  Price","Nettopreis","Precio neto."]
[]
[null,"Sconto","Discount","Rabatt","Descuento"]
[null,"Quantità Pistoni","Quantity","Anzahl","Cantidad"]
[null,"Qt","Qt","Anz.","Qt"]
[null,"prezzo EUR","price EUR","Preis EUR","precio €"]
[null,"Pistone","Ram","Heber","Pistón"]
[null,"Spessore","thickness","Wandstärke","espesor"]
[null,"tipo","model","Typ","modelo"]
[null,"due pezzi","in 2 pieces","in 2 Teilen","en 2 piezas"]
[null,"pezzi 3","in 3 pieces",null,"en 3 piezas"]
[null,"Guarnizione testata","ram head gasket",null,"ram head gasket"]
[null,"set guarnizioni pistone ","set of jack gasket",null,"set of jack gasket"]
[null,"Piastra inferiore pistone (piastra MI)","Lower piston plate (MI plate)",null,"Lower piston plate (MI plate)"]
[null,"dispositivo stelo guidato","guided ram",null,"guided ram"]
[null,"Sconto pistone","Ram Disount","Rabatt Heber","Ram Disount"]
[null,"Prezzo lordo ","Price list","Listenpreis","Price list"]
[null,"Prezzo netto","Net Price","Nettopreis","Net Price"]
[null,"Quantità Centralina","Quantity Power Unit","Anzahl Aggregate","Quantity Power Unit"]
[null,"centralina","power unit","Aggregat","power unit"]
[null,"centralina elettronica","electronic power unit",null,"electronic power unit"]
[null,"code","code","Code","code"]
[null,"potenza","power","Leistung","power"]
[null,"portata","flow rate","Öldurchflussmenge","flow rate"]
[null,"valvola di blocco","rupture valve","Rohrbruchventil","rupture valve"]
[null,"cassone maggiorato","over size tank",null,"over size tank"]
[null,"stella triangolo","star delta","Stern-Dreieck","star delta"]
[null,"silenziatore","silencer","Schalldämpfer","silencer"]
[null,null,"Solenoid voltage","Ventilspannung ","Solenoid voltage"]
[null,"amplificatore protezione motore ","motor protection amplifier",null,"motor protection amplifier"]
[null,"imballo termoretraibile","packing with thermoretractable plastic",null,"packing with thermoretractable plastic"]
[null,"lamiera interna","internal plate",null,"internal plate"]
[null,"disgiuntore a relè per centraline HL monofase","Relay disjunctor, HL power units, single phase",null,"Relay disjunctor, HL power units, single phase"]
[null,"predisposizione centralina per scambiatore di calore","tank arrangement for heat exchanger",null,"tank arrangement for heat exchanger"]
[null,"pressostato NA + NC, 5-70 bar, cablato come","Pressure switch, 5-70 bar, NO+NC, wired as","max Druckschalter (NO)","Pressure switch, 5-70 bar, NO+NC, wired as"]
[null,{"$f":"IF(DATOS!D50=\"CIF\",\"pompa a mano remota con tubi da 5 metri\",\"pompa a mano di manovra in salita\")","v":"pompa a mano di manovra in salita"},{"$f":"IF(DATOS!D50=\"CIF\",\"remote hand pump with 5 meter connection hoses\",\"hand pump\")","v":"hand pump"},"Handpumpe",{"$f":"IF(DATOS!F49=\"CIF\",\"remote hand pump with 5 meter connection hoses\",\"hand pump\")","v":"hand pump"}]
[null,"attacco manometro ispezione  en 81.2","exclusion pressure gauge tap En 81.2","Anschluss Manometer EN 81.2","exclusion pressure gauge tap En 81.2"]
[null,"resistenza scalda olio 400 w  230 v  con termostato","oil heater 400W 230V for tank","Ölheizschlaufe","oil heater 400W 230V for tank"]
[null,"resistenza scalda olio 400 w  400 v  con termostato","oil heater 400W 400V for tank",null,"oil heater 400W 400V for tank"]
[null,"resistenza scalda olio 200 w  230 v  con termostato, per HL","oil heater 200W 230V for HL tank",null,"oil heater 200W 230V for HL tank"]
[null,"soft stop HL","soft stop HL","Soft Stop HL","soft stop HL"]
[null,"soft stop + regolazione 21 (pompe da 15 a 250 l/min)","soft stop + screw #21 (for 15-250 l/min pumps)","Soft Sto + Einstellschraube 21/250","soft stop + screw #21 (for 15-250 l/min pumps)"]
[null,"soft stop + regolazione 21 (pompe da 300 a 380 l/min)","soft stop + screw #21 (for 300-380 l/min pumps)","Soft Sto + Einstellschraube 21/380","soft stop + screw #21 (for 300-380 l/min pumps)"]
[null,"soft stop + regolazione 21 (pompe da 440 a 650 l/min)","soft stop + screw #21 (for 440-650 l/min pumps)","Soft Sto + Einstellschraube 21/650","soft stop + screw #21 (for 440-650 l/min pumps)"]
[null,"microlivellamento in discesa (pompe da 15 a 250 l/min)","down re-levelling electrovalve (for 15 to 250 l/min pumps)",null,"down re-levelling electrovalve (for 15 to 250 l/min pumps)"]
[null,"microlivellamento in discesa (pompe da 300 a 650 l/min)","down re-levelling electrovalve (for 300 to 650 l/min pumps)",null,"down re-levelling electrovalve (for 300 to 650 l/min pumps)"]
[null,"pressostato minima pressione da  2 a 10 bar (NA)","minimum pressure switch (2-10 bar) NO","min. Druckschalter (2-10 bar) NO","minimum pressure switch (2-10 bar) NO"]
[null,"serie guarnizioni per distributore (tipo  hl)","set of gasket valve block HL",null,"set of gasket valve block HL"]
[null,"serie guarnizioni per distributore (tipo  15 l/m – 250 l/m)","set of gasket valve block 15-250 l/m",null,"set of gasket valve block 15-250 l/m"]
[null,"serie guarnizioni per distributore (tipo  300 l/m – 650 l/m)","set of gasket valve block 300-650 l/m",null,"set of gasket valve block 300-650 l/m"]
[null,"pressostato CHD 100 (DINACELL)","Pressure sensor CHD 100 (DINACELL)",null,"Pressure sensor CHD 100 (DINACELL)"]
[null,"indicatore esterno livello cabina","external car position indicator","Ölstandanzeiger","external car position indicator"]
[null,"Sconto centralina","Power Unit discount",null,"Power Unit discount"]
[null,"Prezzo lordo centralina","Price list","Listenpreis","Price list"]
[null,"Prezzo netto centralina","Net price","Nettopreis","Net price"]
[null,"Quantità accessori","Quantity Accessories",null,"Quantity Accessories"]
[null,"Sconto Accessori","Discount Accessories",null,"Discount Accessories"]
[null,"Prezzo lordo accessori","Price list","Listenpreis","Price list"]
[null,"Prezzo netto accessori","Net price","Nettopreis","Net price"]
[null,"Vari netti","Other items",null,"Other items"]
[null,"XXXXX","xxx","x","xxx"]
[null,"XXXXX","xxx","x","xxx"]
[null,"XXXXX","xxx","x","xxx"]
[null,"XXXXX","xxx","x","xxx"]
[null,"totale","Total",null,"Total"]
[null,"Prezzo netto ","Net Pirce",null,"Net Pirce"]
[null,"Prezzo lordo idraulica","price list",null,"price list"]
[null,"Prezzo netto idraulica","Total NET Price",null,"Total NET Price"]
[null,"extrasconto","extra discount",null,"extra discount"]
[null,"Prezzo finale idraulica","Final price",null,"Final price"]
[null,"Valuta","Currency",null,"Currency"]
[]
[null,"Offerta"]
[null,null,"Offer","Angebot","Offer"]
[null,null,"Attention","z.Hd.von","Attention"]
[null,null,"Customer","Kunde","Customer"]
[null,null,"Customer ref.","Kunden-Com.","Customer ref."]
[null,null,"fax","Fax","fax"]
[null,null,"date","Datum","date"]
[null,null,"page","Seiten","page"]
[null,"lunghezza (m)","length (m)","Länge","length (m)"]
[null,null,"plant/s","Anlage/n","plant/s"]
[null,null,"rope side acting ram (2:1)   type 9130","(2:1) Seilaufhaengung Typ 9130","rope side acting ram (2:1)   type 9130"]
[null,null,"direct side acting (1:1)   type 9140","(1:1) Direkte Aufhaengung Typ 9140","direct side acting (1:1)   type 9140"]
[null,null,"direct central (1:1)   type  9150","Zentral (1:1) Typ 9150","direct central (1:1)   type  9150"]
[null,null,"load (Kg)","Nutzlast (kg)","load (Kg)"]
[null,null,"car & frame (Kg)","Gewicht Fahrkorb+Rahmen (kg)","car & frame (Kg)"]
[null,"carico totale su pistone circa (kg)","total load on ram nearly (kg)","ung. Gesamtgewicht auf Kolben (kg) ","Carga total sobre el pistón aprox. (kg)"]
[null,null,"total load on ram (Kg)","Gesamtgewicht auf Kolben (kg)","total load on ram (Kg)"]
[null,null,"stroke (mm)","Förderhöhe (mm)","stroke (mm)"]
[null,null,"      total extrastroke (mm)","     Reservehub (mm)","      total extrastroke (mm)"]
[null,null,"    speed (m/s)  ","     Geschwindigkeit (m/s)","    speed (m/s)  "]
[null,null,"each plant is built-up with the following items",null,"each plant is built-up with the following items"]
[null,null,"jack:   ram diameter (mm)  ","Kolben: Durchmesser (mm)","jack:   ram diameter (mm)  "]
[null,null,"     rod thickness (mm)","     Wandstärke (mm)","     rod thickness (mm)"]
[null,null,"   total length (mm) ","     geschlossene Kolbenlaenge (mm)","   total length (mm) "]
[null,null,"divided in","geteilt","divided in"]
[null,null,"  piece/s","  Stück","  piece/s"]
[null,null,"with guided tools (ring+tools)",null,"with guided tools (ring+tools)"]
[null,null,"            without hole, hose connection thread","          EN 81.2;         Anschluß","            without hole, hose connection thread"]
[null,null,"position"," Position","position"]
[null,null," according to dwg. 9150"," sehen Seite 9150"," according to dwg. 9150"]
[null,null," mm  from the bottom"," mm von unten"," mm  from the bottom"]
[null,null,"diameter","Durchmesser","diameter"]
[null,null,"  model"," Typ","  model"]
[null,null,"  pressure max. (bar)"," Druck max. (bar)","  pressure max. (bar)"]
[null,null,"  min.(bar)  "," min. (bar)","  min.(bar)  "]
[null,null,"electrical motor: power (KW) ","   Motorleistung (kW)","electrical motor: power (KW) "]
[null,null,"    monophase tension (V)  ","  Einphasen Sannung (V)","    monophase tension (V)  "]
[null,null,"    tension (V)  ","  Spannung (V)","    tension (V)  "]
[null,null,"  frequency (Hz) 50","  Frequenz (Hz)","  frequency (Hz) 50"]
[null,null,"starting","Anschluß","starting"]
[null,null," direct"," Dreieck"," direct"]
[null,null," star delta"," Stern-Dreieck"," star delta"]
[null,null,"star-delta valve","Stern Ventil","star-delta valve"]
[null,null,"Price Hydraulic","Preis","Price Hydraulic"]
[null,null,"Price Hydraulic for each plant","Preis / Stuck","Price Hydraulic for each plant"]
[null,null,"price quoted","Preis","price quoted"]
[null,null,"Delivery time","Liefertermin","Delivery time"]
[null,null,"Payment","Zahlung","Payment"]
[null,null,"PLEASE CONFIRM BY RETURN FAX","BESTÄTIGUNG BITTE MIT FAX","PLEASE CONFIRM BY RETURN FAX"]
[null,null,"Best Regards","mit Freundliche Grüßen","Best Regards"]
[null,null,"Ex Works","Ex Works","Ex Works"]
[null,null,"4 weeks","4 Wochen","4 weeks"]
[null,null,"in advance","im voraus","in advance"]
[null,"Pistone e Centralina","Piston and Power unit",null,"Pistón y central"]
[null,"Componenti richiesti","Required Components",null,"Componentes requeridos"]
[null,"Pistone","Piston",null,"Pistón"]
[null,"in taglia 2:1 e laterale 9130","2:1 roped side-acting, 9130",null,"Suspension 2:1 9130"]
[null,"diretto laterale 9140","direct side-acting, 9140",null,"Tiro directo 9140"]
[null,"diretto centrale 9150","direct central underground, 9150",null,"Tiro directo enterrado 9150"]
[null,"ingresso olio su pistone","oil inlet on piston",null,"Entrada de aceite"]
[null,"in alto","on top",null,"Arriba"]
[null,"in basso","at bottom",null,"Abajo"]
[null,"valvola VMI contro i movimenti incontrollati (per HL)","VMI valve against uncontrolled movements (per HL)",null,"Válvula VMI movimiento incontrolado de cabina (para HL)"]
[null,"sistema per emendamento A.3","A.3 amendment system",null,"Sistema enmienda A3"]
[null,"alimentazione scheda eKMI","eKMI board power supply",null,"eKMI tarjeta alimentación"]
[null,"KMI non richiesto: dato non necessario","KMI not requested",null,"KMI dato no necesario"]
[null,"armadio completo per centralina HL-300/AR","Complete roomless box for HL-300/AR tank",null,"Complete roomless box for HL-300/AR tank"]
[null,"armadio completo per centralina HL-420/AR","Complete roomless box for HL-420/AR tank",null,"Complete roomless box for HL-420/AR tank"]
[null,"armadio completo per centralina HL-300/AR – smontato","Complete roomless box for HL-300/AR tank (disassembled version)",null,"Complete roomless box for HL-300/AR tank (disassembled version)"]
[null,"armadio completo per centralina HL-420/AR – smontato","Complete roomless box for HL-420/AR tank (disassembled version)",null,"Complete roomless box for HL-420/AR tank (disassembled version)"]
[null,"valvola di discesa di emergenza 12 VDC per centralina elettronica","emergency lowering valve 12 VDC for electronic power unit",null,"emergency lowering valve 12 VDC for electronic power unit"]
[null,"lunghezza tubo da KMI a valvola paracadute","hose length between KMI and rupture valve",null,"hose length between KMI and rupture valve"]
[null,"voltaggio alimentazione motore","motor power supply voltage",null,"Tension alimentación motor"]
[null,"N.A.","N.O.",null,"N.A."]
[null,"armadio completo per centralina HL/OIL-265","Complete roomless box for HL/OIL-265 tank",null,"Complete roomless box for HL/OIL-265 tank"]
[null,"armadio – MI 2000 – per CM-320/AR colore RAL 7035","Roomless Box MI-2000 for CM-320/AR color RAL 7035",null,"Roomless Box MI-2000 for CM-320/AR color RAL 7035"]
[null,"armadio – MI 2000 – per CM-320/A colore RAL 7035, smontato","Roomless Box MI-2000 for CM-320/A color RAL 7035 (disassembled)",null,"Roomless Box MI-2000 for CM-320/A color RAL 7035 (disassembled)"]
[null,"valvola VMI2 contro i movimenti incontrollati (per ascensori)","VMI2 valve against uncontrolled movements (for elevators)",null,"VMI2 valve against uncontrolled movements (for elevators)"]
[null,"dato non necessario","data input not needed",null,"data input not needed"]
[null,"imballo centralina","power unit packaging",null,"power unit packaging"]
[null,"standard: con foglio termoretraibile","standard: with thermoplastic foil",null,"standard: with thermoplastic foil"]
[null,"con bancale fumigato e scatola di cartone","with cardboard box and fumigated pallet",null,"with cardboard box and fumigated pallet"]
[null,"con cassa di legno compresso","with full plywood crate",null,"with full plywood crate"]
[null,"quadrato","with square flange",null,"with square flange"]
[null,"tensione bobina su door lock valve","door lock valve coil voltage",null,"Tensión bobina válvula A3"]
[null,"discesa emergenza su door lock valve","emergency voltage on door lock valve",null,"Tensión bobina emergencia válvula A3"]
[null,"door lock valve non richiesta","door lock valve not requested",null,"door lock valve not requested"]
[null,"tanica recupero olio pistone, 5 litri","oil recovery tank for piston, 5 liters",null,"oil recovery tank for piston, 5 liters"]
[null,null,"Customer:","Kunde:","Cliente"]
[null,null,"Lift reference:","Bezugnummer der anlage:","Referncia Instalación:"]
[null,null,"INSTALLATION DATA","TECHNISCHE DATEN","DATOS DE LA INSTALACION"]
[null,null," Reeving ratio"," Flaschenzugkoeffizent","  Suspensión 1 (1:1) 2 (2:1)                                                                                 "]
[null,null," Rated Load"," Nennlast","  Carga nominal                                                                                                   "]
[null,null," Mass of the car and connected devices"," Masse des Fahrstuhleseite","  Peso de la cabina y chasis"]
[null,null," Mass of the ropes"," Masse der Seile an der Fahrstuhleseite","  Peso de los cables lado cabina"]
[null,null," Mass of the devices connected to the ram head"," Masse der mit dem Kolben verbundenen Organe","  Peso de la polea"]
[null,null," Number of jack(s)"," Kolbenanzahl","  Número de pistones."]
[null,null," Jack split into 1,2,3 piece(s)"," Kolben 1-2-3 teiling","  Pistón dividido en 1,2,3 piezas"]
[null,null," Ram guide (not=1; yes=2)","  mit Führung (nein=1; ja=2)","  Pistón guiado (no = 1; si = 2)"]
[null,null," Total ram stroke"," Kolbenhub","  Recorrido  total del pistón                 "]
[null,null," Distance between ram top and pulley centre"," Abstand zwischen Seilrollenahcse und Kolbenspitze","  Distancia entre eje de polea y cabeza del vastago"]
[null,null,"Buckling lenght (Lp/gds+L1+g)           "," Ausbiegungslänge (Lp/gds+L1+g)           ","  Longitud libre de inflexión (Lp/gds+L1+g)                "]
[null,null,"Mass of one ram joint"," Masse eines Kolbenstangenansatzes","  Peso de la unión                      "]
[null,null,"Mass of the ram (per metre)"," Lineare Kolbenmasse","  Peso del vastago por metro                           "]
[null,null,"Total mass of the ram (Lp*q)/100+Pgs*(n-1)    "," Gesamte Kolbenmasse","  Peso total del vastgago (Lp*q)/100+Pgs*(n-1)         "]
[null,null,"Total load on ram top:"," Gesamtlast an der Kolbenspitze"," Carga total sobre el pistón"]
[null,null,"   with full load T=gn/10*[cm*(Q+P3)/Nr+Pf+Prh]     ","   bei Volladung             T=gn/10*[cm*(Q+P3)/Nr+Pf+Prh]     ","    a plena carga     T=gn/10*[cm*(Q+P3)/Nr+Pf+Prh]     "]
[null,null,"   with empty car Tv=gn/10*[cm*(P3)/Nr+Pf+Prh]      ","   bei leerem Fahrstuhle     Tv=gn/10*[cm*(P3)/Nr+Pf+Prh]      ","    a cabina vacia   Tv=gn/10*[cm*(P3)/Nr+Pf+Prh]      "]
[null,null," Piezometric height","   Druckhöhe","  Altura piezométrica                              "]
[null,null," Specific weight of the oil","   Wichte der verwendenten Flüssigkeit","  Peso específico del fluido hidraulico"]
[null,null," Standard acceleration of free fall","   Fallbeschleunigung","  Acceleración de la gravedad              "]
[null,null," Static press. with load          (T+Pr*gn/10)/A+(y*H/10)","   Ruhedruck bei Vollandung  (T+Pr*gn/10)/A+(y*H/10) ","  Pres. stat. a plena carga (T+Pr*gn/10)/A+(y*H/10) "]
[null,null," Static press. with empty car  (T+Pr*gn/10)/A+(y*H/10) ","   Ruhedruck bei leerem Fahrstuhle (T+Pr*gn/10)/A+(y*H/10) ","  Pres. stat. en vacio          (Tv+Pr*gn/10)/A+(y*H/10)   "]
[null,null," Pressure relief valve setting <= pstat * 1,4","   Eichuung des Sichrheitsventils=< pstat*1.4     ","  Tarado de la válvula de sobrepresión =< pstat*1.4     "]
[null,null,"JACK","KOLBEN","PISTÓN"]
[null,null,"1- The strength of a split jack is equal to or greater than that of a single piece jack.","1- Das Verbindungssystem zwischen Kolben- und Zvlinderelementen gewährleistet, bei einer mehrteiligen Ausführung,eine Kolbenfestigkeit, die diejenige eines gleichgroßen Einzelteil-Kolben nicht unterschreitet. ","1- El sistema de unión entre los elementos del pistón y del cilindro, cuando se fabrica en varias piezas, asegura una resistencia no inferior a la de un pistón de iguales dimensiones construido en una sola pieza"]
[null,null,"2- The upper limit of The ram stroke is given by contact of The ram bottom on to The cylinder head.","2- Die obere Kolbenhubgrenze wird durch das Aufsetzen des Bodens auf den Zylinder - koft bestimbmt.","2- El límite superior del recorrido del pistón es determinado por el tope del fondo sobre la cabeza del cilindro (tope amortiguado)."]
[null,null,"3- With The car on The compressed pit buffer The bottom of The ram is not in contact With The cylinder base.","3- Wenn der Fahrstuhle unten, auf den völlig eingefederten Puffern liegt, berührt der Kolben den Zylinderboden nicht","3- Con la cabina apoyada en la parte inferior, sobre los amortiguadores comprimidos totalmente, el pistón no toca el fondo del cilindro"]
[null,null,"MATERIAL","MATERIAL","MATERIAL"]
[null,null,"  Modulus of elasticity","  Elastizitätmodul","  Modulo de elasticidad                    "]
[null,null,"  Material:  St  52,0 (NBK)  DIN 1629 / DIN 2391","  Material:  St  52,0 (NBK)  DIN 1629 / DIN 2391","  Material:  St  52,0 (NBK)  DIN 1629 / DIN 2391"]
[null,null,"  Tensile strength","  Einheitliche Bruchlast","  Limite convenzional de elasticidad                "]
[null,null,"Proof stress (non - proportional elongation)","  Dehngrenze","  Resistencia a la tracción del material"]
[null,null,"JACK: DATA","KOLBEN: TECHNISCHE DATEN","DATOS DEL PISTON"]
[null,null," Ram outer diameter"," Außendurchmesser des Kolbens","  Diametro externo de la varilla          "]
[null,null," Ram inner diameter"," Innendurchmesser des Kolbens","  Diametro interno de la varilla"]
[null,null," Ram thinckness"," Wanddicke der Kolbenstange","Espesor de la varilla                                  "]
[null,null," Moment of inertia pi / 640000 * (d^4 - di^4)"," Trägheitsmoment pi/640000*(d^4 - di^4)","  Momento de inercia          pi/640000*(d^4-di^4)      "]
[null,null," Ram area pi/400*d²"," Flaäche der Kolbenstange  pi/400*d^2     ","  Area del la varilla                pi/400*d^2                "]
[null,null," Cross sectional area pi / 400 * (d² - di²)"," Mittrangende Schnittfläche pi/400*(d^2-di^2)","  Sección resistente           pi/400*(d^2-di^2)         "]
[null,null," Radius of gyration (J / F)^½"," Trägheitshalbmesser (J/F)^1/2 ","  Radio de inercia           (J/F)^1/2                 "]
[null,null,"BUCKLING CALCULATION","KNIKCUNGPRÜFUNG","VERIFICACIÓN DE  LA CARGA EN PUNTA"]
[null,null," slenderness ratio = L / i"," Schlankheitsgrad = L / i","  Grado de esbeltez           L/i                  "]
[null,null,"Effective buckling force","IST-Spitzenlast","Carga en punta efectiva"]
[null,null,"Maximum allwable weight","MAX. Zulässige Last","Carga máxima admisible"]
[null,null,"SAFETY COEFFICIENT","SICHERHEITSKOEFFIZIENT","COEFICIENTE DE SEGURIDAD"]
[null,null,"CALCULATION OF RAM THINKNESS","PRUFÜNG DER WANDFESTIGKEIT BEIM RADIALDRUCK","VERIFICACIÓN DE  RESISTENCIA DE LA PARED A PRESION RADIAL"]
[null,null,"CYLINDER","ZYLINDER","CILINDRO"]
[null,null," Material: Fe 510 UNI EN 10025"," Material: Fe 510 UNI EN 10025","  Material:  St  52,0 (NBK)  DIN 1629 / DIN 2448"]
[null,null," Proof stress (non proportional elongation)"," Dehngrenze","  Limite convenzional de elasticidad          "]
[null,null,"CYLINDER: DATA","ZYLINDER: TECHNISCHE DATEN","DATO DEL CILINDRO"]
[null,null," Type"," Modell","  Modelo Piston"]
[null,null," Cylinder outer diameter"," Außendurchmesser des Zylinders","  Diametro externo del cilindro                          "]
[null,null," Cylinder inner diameter"," Innendurchmesser des Zylinders","  Diametro interno del cilindro                        "]
[null,null," Cylinder thinckness"," Zylinderdicke","  Espesor del cilindro                        "]
[null,null,"CALCULATION OF CYLINDER THICKNESS","PRUFÜNG BEI ZYLINDERINNENDRUCK","VERIFICACIÓN PRESIÓN INTERNA DEL CILINDRO"]
[null,null,"CALCULATION OF THE CYLINDER BASE (WITH RELIEVING GROOVE)","PRUFÜNG BEI INNENDRUCK DES ZYLINDERRBODENS (MIT ABLAUFRILLE)","VERIFICACIÓN A PRESIÓN INTERNA DEL FONDO DEL CILINDRO (CON RANURA DE DESAHOGO)"]
[null,null," Thikness of relieving groove wall"," Dicke der Innenwand der Rille","  Espesor de la pared interna de la ranura       "]
[null,null," Thickness of the base"," Bodendicke","  Espesor del fondo                  "]
[null,null," Radius of the relieving groove"," Radius der Ablaufrille","  Radio de la ranura de desahogo                         "]
[null,null," Thickness of the groove base"," Dicke des Ablaufrillenbodens","  Espesor del fondo de la ranura de desahogo        "]
[null,null,"CONNECTION PIPE BETWEEN THE POWER UNIT AND THE RUPTURE VALVE","ROHRLEITUNG ZUR VERBINDUNG DES HYDRAULISCHEN AGGREGATS","CONDUCCIÓN DE CONEXIÓN ENTRE LA CENTRAL Y LA VÁLVULA PARACAÍDAS"]
[null,null," Material: St 37,0  (GBK) DIN 1629 / DIN 2391"," Material: St 37,0  (GBK) DIN 1629 / DIN 2391","  Material: St 37,0  (GBK) DIN 1629 / DIN 2391"]
[null,null," Proof stress (non proportional elongation)"," Dehngrenze","  Limite convencional de elasticidad          "]
[null,null," Pipe outer diameter"," Außendurchmesser der Rohrleitung","  Diámetro externo de la conducción         "]
[null,null," Pipe thickness"," Innendurchmesser der Rohrleitung","  Espesor de la conducción                                 "]
[null,null,"CALCULATION OF THE PIPE THICKNESS","PRÜFUNG BEI INNENDRUCK","VERIFICACIÓN DE LA PRESIÓN INTERNA"]
[null,null,"All the valves and connections are designed and manufactured to a safety factor greater than 1.7 with respect to the proof stress (non proportional elongation) calculated on a pressure 2.3 times the maximum static pressure.","All Ventile und Verbindungen wurden dermaßen berechnet und hergestellt, daß bei einer ruckbelastung, die dem 2.3-Fachen des maximalen Ruhedrucks entspricht, ein Sicherheitskoeffizient von 1.7 gegenüber der Dehngrenze der verwendenten Materialen Rp0.2","Las válvulas y todas las conexión están calculadas y construidas de modo que, bajo los esfuerzos derivados de una persión 2,3 veces la presion estática máxima, está garantizado un coeficiente de seguridad de 1,7 respecto al límite convencional de Rp0,2"]
[null,null,"JACK CALCULATION","KOLBEN BERECHNUNG","CÁLCULO DEL PISTÓN"]
[null,null,"ACCORDING TO EN 81-50:2014","GEMÄSS EN 81-50:2014","CONFORME EN 81-50:2014"]
[null,null,"SIGNTAURE AND STAMP OF MANUFACTURER __________________________________","STEMPEL UND UNTERSCHRIFT DES HESTELLERS __________________________________","SELLO Y FIRMA __________________________________"]
[null,"Frequenza motore","Motor frequency","Motorfrequenz","Frecuencia Motor"]

{"sheet":"COMPRESIBILIDAD DEL ACEITE","index":17,"n_rows":33,"n_cols":29,"rows_kept":33,"cut":false,"hidden":false,"merged":[[10,25,10,26],[7,6,7,7],[7,12,7,13],[7,18,7,19],[7,25,7,26],[8,25,8,26],[9,25,9,26],[5,6,5,7],[5,12,5,13],[5,18,5,19],[6,6,6,7],[6,12,6,13],[6,18,6,19]]}
[]
[null,"Datos a introducir",null,null,null,null,"Deriva del ascensor por disminución de Temperatura",null,null,null,null,null,"Deriva del ascensor por Incremento de Presión",null,null,null,null,null,"Disminución de la presión por disminución de temperatura en un circuito cerrado",null,null,null,null,null,null,"Disminución de la presión en función de la deriva"]
[null,null,null,null,null,null,"ΔT (ºC)","Disminución de Temperatura",null,null,null,null,"ΔP (bar)","Incremento de Presión",null,null,null,null,"ΔT (ºC)","Disminución de Temperatura",null,null,null,null,null,"ΔP (bar)","Disminución de Presión"]
[null,"Cálculos",null,null,null,null,"a (cm)","Deriva",null,null,null,null,"a (cm)","Deriva",null,null,null,null,"ΔP (bar)","Disminución de Presión",null,null,null,null,null,"a (cm)","Deriva"]
[null,null,null,null,null,null,null,null,null,null,null,null,null,null,null,null,null,null,null,null,null,null,null,null,null,"β","Factor de compresibilidad del fluido "]
[null,null,null,null,null,null,"T inicial",null,31,"ºC",null,null,"P inicial",null,{"$f":"DATOS!D40","v":23.39178238215667},"bar",null,null,"T inicial",null,31,"ºC",null,null,null,"Av","Sección del émbolo"]
[null,"Tiro","r",{"$f":"DATOS!D8","v":"2"},":1",null,"T final",null,30,"ºC",null,null,"P final",null,{"$f":"DATOS!D39","v":39},"bar",null,null,"T final",null,30,"ºC",null,null,null,"VT","Volumen de aceite con camisa desplegada"]
[null,"Longitud de Cilindro","Lp",{"$f":"DATOS!D21","v":1550},"mm",null,"Deriva final",null,{"$f":"D$7*D$14*D$11*(I6-I7)*100/D$15","v":4.7896849244897961},"mm",null,null,"Deriva final",null,{"$f":"D$7*D$14*D$12*(O7-O6)*100/D$15","v":10.042179128374061},"mm",null,null,"Disminución Presión",null,{"$f":"D$11*(U6-U7)/D$12","v":7.4444444444444446},"bar",null,null,null,"T inicial",null,31,"ºC"]
[null,"Diámetro de émbolo ","de",{"$f":"'EN 81.50'!D49","v":70},"mm",null,null,null,null,null,null,null,null,null,null,null,null,null,null,null,null,null,null,null,null,"T final",null,30,"ºC"]
[null,"Diámetro interno camisa ","dci",{"$f":"'EN 81.50'!D73","v":106.3},"mm",null,null,null,null,null,null,null,null,null,null,null,null,null,null,null,null,null,null,null,null,"Disminución Presión",null,{"$f":"((D$7*D$14*D$11*(AB8-AB9)*100/D$15)*D$15*10000)/(D$12*D$14*1000000)","v":14.888888888888891},"bar"]
[null,"Factor de dilatación térmica del fluido ","α",6.7000000000000002E-4,"ºC-1",null,null,null,null,null,null,null,null,null,null,null,null,null,null,null,null,null,null,null,null,"Deriva final",null,{"$f":"D$7*D$14*D$11*(AB8-AB9)*100/D$15","v":4.7896849244897961},"mm"]
[null,"Factor de compresibilidad del fluido ","β",9.0000000000000006E-5,"bar-1",null,"ΔT (ºC)","a (cm)","a (mm)",null,null,null,"ΔP (bar)","a (cm)","a (mm)",null,null,null,"ΔT (ºC)","ΔP (bar)"]
[null,null,null,null,null,null,1,{"$f":"D$7*D$14*D$11*G13*10/D$15","v":0.47896849244897954},{"$f":"H13*10","v":4.7896849244897952},null,null,null,1,{"$f":"D$7*D$14*D$12*M13*10/D$15","v":6.4339051224489796E-2},{"$f":"N13*10","v":0.64339051224489796},null,null,null,1,{"$f":"D$11*S13/D$12","v":7.4444444444444446},null,null,null,null,null,"ΔT (ºC)","a (mm)","ΔP (bar)"]
[null,"Volumen de aceite con camisa desplegada","VT",{"$f":"PI()*(D10^2)*D8/(4*1000000)","v":13.755871448088792},"dm3",null,2,{"$f":"D$7*D$14*D$11*G14*10/D$15","v":0.95793698489795909},{"$f":"H14*10","v":9.5793698489795904},null,null,null,2,{"$f":"D$7*D$14*D$12*M14*10/D$15","v":0.12867810244897959},{"$f":"N14*10","v":1.2867810244897959},null,null,null,2,14.888888888888889,null,null,null,null,null,1,{"$f":"D$7*D$14*D$11*Z14*100/D$15","v":4.7896849244897961},{"$f":"(AA14*D$15*10000)/(D$12*D$14*1000000)","v":14.888888888888891}]
[null,"Sección del émbolo","Av",{"$f":"PI()*(D9^2)/(4*10000)","v":0.38484510006474965},"dm2",null,3,1.436905477346939,14.36905477346939,null,null,null,3,0.19301715367346933,1.9301715367346932,null,null,null,3,22.333333333333332,null,null,null,null,null,2,9.5793698489795922,29.777777777777782]
[null,null,null,null,null,null,4,1.9158739697959182,19.158739697959181,null,null,null,4,0.25735620489795918,2.5735620489795918,null,null,null,4,29.777777777777779,null,null,null,null,null,3,14.369054773469387,44.666666666666664]
[null,null,null,null,null,null,5,2.3948424622448981,23.948424622448982,null,null,null,5,0.32169525612244898,3.21695256122449,null,null,null,5,37.222222222222221,null,null,null,null,null,4,19.158739697959184,59.555555555555564]
[null,null,null,null,null,null,6,2.8738109546938779,28.73810954693878,null,null,null,6,0.38603430734693867,3.8603430734693864,null,null,null,6,44.666666666666664,null,null,null,null,null,5,23.948424622448979,74.444444444444443]
[null,null,null,null,null,null,7,3.3527794471428569,33.527794471428571,null,null,null,7,0.45037335857142857,4.5037335857142855,null,null,null,7,52.111111111111107,null,null,null,null,null,6,28.738109546938773,89.333333333333329]
[null,null,null,null,null,null,8,3.8317479395918363,38.317479395918362,null,null,null,8,0.51471240979591837,5.1471240979591837,null,null,null,8,59.555555555555557,null,null,null,null,null,7,33.527794471428571,104.22222222222223]
[null,null,null,null,null,null,9,4.3107164320408167,43.107164320408167,null,null,null,9,0.57905146102040805,5.790514610204081,null,null,null,9,67,null,null,null,null,null,8,38.317479395918369,119.11111111111113]
[null,null,null,null,null,null,10,4.7896849244897961,47.896849244897965,null,null,null,10,0.64339051224489796,6.4339051224489801,null,null,null,10,74.444444444444443,null,null,null,null,null,9,43.10716432040816,133.99999999999997]
[null,null,null,null,null,null,11,5.2686534169387746,52.686534169387748,null,null,null,11,0.70772956346938765,7.0772956346938765,null,null,null,11,81.888888888888886,null,null,null,null,null,10,47.896849244897957,148.88888888888889]
[null,null,null,null,null,null,12,5.7476219093877559,57.47621909387756,null,null,null,12,0.77206861469387733,7.7206861469387729,null,null,null,12,89.333333333333329,null,null,null,null,null,11,52.686534169387748,163.77777777777777]
[null,null,null,null,null,null,13,6.2265904018367353,62.265904018367351,null,null,null,13,0.83640766591836713,8.3640766591836719,null,null,null,13,96.777777777777786,null,null,null,null,null,12,57.476219093877546,178.66666666666666]
[null,null,null,null,null,null,14,6.7055588942857138,67.055588942857142,null,null,null,14,0.90074671714285715,9.007467171428571,null,null,null,14,104.22222222222221,null,null,null,null,null,13,62.265904018367351,193.55555555555557]
[null,null,null,null,null,null,15,7.1845273867346933,71.845273867346933,null,null,null,15,0.96508576836734683,9.6508576836734683,null,null,null,15,111.66666666666666,null,null,null,null,null,14,67.055588942857142,208.44444444444446]
[null,null,null,null,null,null,16,7.6634958791836727,76.634958791836723,null,null,null,16,1.0294248195918367,10.294248195918367,null,null,null,16,119.11111111111111,null,null,null,null,null,15,71.845273867346933,223.33333333333334]
[null,null,null,null,null,null,17,8.1424643716326539,81.424643716326543,null,null,null,17,1.0937638708163264,10.937638708163265,null,null,null,17,126.55555555555556,null,null,null,null,null,16,76.634958791836738,238.22222222222226]
[null,null,null,null,null,null,18,8.6214328640816333,86.214328640816333,null,null,null,18,1.1581029220408161,11.581029220408162,null,null,null,18,134,null,null,null,null,null,17,81.424643716326528,253.11111111111114]
[null,null,null,null,null,null,19,9.1004013565306128,91.004013565306124,null,null,null,19,1.2224419732653062,12.224419732653063,null,null,null,19,141.44444444444443,null,null,null,null,null,18,86.214328640816319,267.99999999999994]
[null,null,null,null,null,null,20,9.5793698489795922,95.793698489795929,null,null,null,20,1.2867810244897959,12.86781024489796,null,null,null,20,148.88888888888889,null,null,null,null,null,19,91.004013565306124,282.88888888888891]
[null,null,null,null,null,null,null,null,null,null,null,null,null,null,null,null,null,null,null,null,null,null,null,null,null,20,95.793698489795915,297.77777777777777]