{"text_format":"1","workbook":"xlsx","n_sheets":18,"sheets":["Foglio1","database2","DATOS","accessori vari","offerta","Offer","NOTE","calcoli vari","centraline","Prezzo P","database1","accessori centralina","EN 81.50","EN 81.50 (T)","EN 81.50 HCR-75","velocidad","lingue","COMPRESIBILIDAD DEL ACEITE"],"not_rendered":{"charts":7,"images":11,"macros":1,"external_links":1,"defined_names":10,"comments":1,"pivot_tables":0},"unopened":[],"bounds":{"document_bytes":16777216,"sheet_cells":100000,"rows_first":2000,"rows_last":500,"rows_between":2000,"halvings":0,"cell_chars":16384,"cell_head_chars":4096},"cells_cut":0,"cells_raw":0,"read":"whole","date_system":"1900"}

{"sheet":"Foglio1","index":0,"n_rows":0,"n_cols":0,"rows_kept":0,"cut":false,"hidden":true,"merged":[]}

{"sheet":"database2","index":1,"n_rows":28,"n_cols":15,"rows_kept":28,"cut":false,"hidden":true,"merged":[]}
[]
[]
[]
["CENTRALINE",null,null,null,null,null,null,null,null,null,null,"PESO","QUANTITA' OLIO"]
["TIPO",null,"POMPA","A","TUBO","B","C","D","E","F","G","SENZA OLIO","min","utile","totale"]
["CB",null,55,"1\"1/4",35,830,950,580,235,630,450,140,50,100,{"$f":"SUM(M6:N6)","v":150}]
["CB",null,75,"1\"1/4",35,830,950,580,235,630,450,140,50,100,150]
["CB",null,100,"1\"1/4",35,830,950,580,235,630,450,140,50,100,150]
{"$rows_left_out":21}
{"sheet":"DATOS","index":2,"n_rows":81,"n_cols":37,"rows_kept":81,"cut":false,"hidden":false,"merged":[]}
[null,"CALCULO EQUIPOS HIDRAULICOS",null,2023,null,null,null,null,null,null,"indice","diam.","spess.","pompa","CIF","valv.","riemp.","bobine","emerg.","NTA","an.protez.","da quotare","da quotare","tipo pistone","tipo piston","tipo pistone","attacco pistone","attacco pistone","centralina","emend. A3","eKMI","motore","pressostato","imballo centr.","Tipo manguera hidraulica","litros/m","Herzios"]
[null,null,null,"V.14",null,null,null,null,null,"diam",4,36,0,8,"NO","STD","S","12 VDC","12 VDC","230 VAC",0,1,{"$f":"INDEX(lingue!B257:E257,1,DATOS!$B$5)","v":"Pistón y central"},9130,"2",{"$f":"INDEX(lingue!B260:E260,1,DATOS!$B$5)","v":"Suspension 2:1 9130"},1,{"$f":"INDEX(lingue!B265:E265,1,DATOS!$B$5)","v":"Abajo"},"Lift","NO","12 VDC","230 VAC,  mono","N.C.",{"$f":"INDEX(lingue!B284:E284,1,DATOS!$B$5)","v":"standard: with thermoplastic foil"},"3/4''",0.31,50]
[null,null,null,{"$f":"TODAY()","v":"2023-11-30"},null,null,null,null,null,"spess",2,50,5,12,"CIF","ELE","D","24 VDC","NO","400 VAC",1,2,{"$f":"INDEX(lingue!B259:E259,1,DATOS!$B$5)","v":"Pistón"},9140,"1",{"$f":"INDEX(lingue!B261:E261,1,DATOS!$B$5)","v":"Tiro directo 9140"},2,{"$f":"INDEX(lingue!B264:E264,1,DATOS!$B$5)","v":"Arriba"},"HL","KMI","24 VDC","240 VAC,mono",{"$f":"INDEX(lingue!B277:D277,1,'accessori centralina'!$A$1)","v":{"$error":"#REF!"}},{"$f":"INDEX(lingue!B285:E285,1,DATOS!$B$5)","v":"with cardboard box and fumigated pallet"},35,0.65,60]
[null,null,null,null,null,null,null,null,null,"pompa",8,60,6,18,null,null,null,"48 VDC",null,null,null,3,{"$f":"INDEX(lingue!B55:E55,1,DATOS!$B$5)","v":"Central"},9150,1,{"$f":"INDEX(lingue!B262:E262,1,DATOS!$B$5)","v":"Tiro directo enterrado 9150"},null,null,null,"Door lock valve",null,"230x3 VAC",null,{"$f":"INDEX(lingue!B286:E286,1,DATOS!$B$5)","v":"with full plywood crate"},42,1]
[null,4,null,null,null,null,null,null,null,"centr.elettr.",1,70,7.5,23,null,null,null,"60 VDC",null,null,null,null,null,"MCE",2,"Suspensión 2:1 MCE",null,null,null,null,null,"400x3 VAC",null,null,"2''",2.16]
[null,{"$f":"INDEX(lingue!B258:E258,1,DATOS!$B$5)","v":"Componentes requeridos"},null,{"$f":"INDEX(V2:V4,K12,1)","v":1},null,null,null,null,null,"riemp.",1,80,10,30,null,null,null,"80 VDC",null,null,null,null,null,"MCS",2,"Suspensión 2:1  MCS",null,null,null,null,null,"415x3 VAC"]
[null,{"$f":"INDEX(lingue!B2:E2,1,DATOS!$B$5)","v":"Modelo Piston (9130;9140;9150;MCS;MCE)"},null,{"$f":"INDEX(X2:X13,K13,1)","v":9130},{"$f":"INDEX(Y2:Y13,K13,1)","v":"2"},{"$f":"IF(OR(D7=9130,D7=9150,D7=9140,D7=\"MCE\",D7=\"MCS\",D7=\"CRA\",D7=\"T\",D7=\"HCR-75\"),\"OK\",\"Errore\")","v":"OK"},null,null,null,"bobine",2,85,12,35,null,null,null,"90 VDC",null,null,null,null,null,"MCE",1,"Tiro directo MCE"]
[null,{"$f":"INDEX(lingue!B3:E3,1,DATOS!$B$5)","v":"Suspension (2 2:1) (1 1:1)"},"cm =",{"$f":"$E$7","v":"2"},null,null,null,null,null,"emerg.",{"$f":"IF(D44=\"Lift\",1,2)","v":1},90,8,45,null,null,null,"99 VDC",null,null,null,null,null,"MCS",1,"Tiro directo MCS"]
{"$rows_left_out":74}
{"sheet":"accessori vari","index":3,"n_rows":76,"n_cols":6,"rows_kept":76,"cut":false,"hidden":true,"merged":[]}
[4]
[]
[{"$f":"INDEX(lingue!B61:E61,1,'accessori vari'!A1)","v":"Cantidad"},null,1,null,{"$f":"INDEX(lingue!B62:E62,1,'accessori vari'!A1)","v":"Precio"}]
[0,{"$f":"INDEX(lingue!B63:E63,1,'accessori vari'!$A$1)","v":"barra tubo mandata  ø 35 x 2,5 (m 6)"},"5438 / P",{"$f":"'Prezzo P'!C142","v":68},{"$f":"+D4*A4*$C$3","v":0}]
[0,{"$f":"INDEX(lingue!B64:E64,1,'accessori vari'!$A$1)","v":"barra tubo mandata  ø 42 x  3   (m 6)"},"5439 / P",{"$f":"'Prezzo P'!C143","v":97},{"$f":"+D5*A5*$C$3","v":0}]
[0,{"$f":"INDEX(lingue!B65:E65,1,'accessori vari'!$A$1)","v":"Racor a 90º  ø 28 salida vertical en central"},{"$f":"lingue!A65","v":"KIT.RACC/VER28"},{"$f":"'Prezzo P'!C149","v":12},0]
[0,{"$f":"INDEX(lingue!B66:E66,1,'accessori vari'!$A$1)","v":"Racor a 90º  ø 35 salida vertical en central"},{"$f":"lingue!A66","v":"KIT.RACC/VER35"},{"$f":"'Prezzo P'!C150","v":22},0]
[0,{"$f":"INDEX(lingue!B67:E67,1,'accessori vari'!$A$1)","v":"Racor a 90º  ø 42 salida vertical en central"},{"$f":"lingue!A67","v":"KIT.RACC/VER42"},{"$f":"'Prezzo P'!C151","v":29},{"$f":"+D8*A8*$C$3","v":0}]
{"$rows_left_out":69}
{"sheet":"offerta","index":4,"n_rows":160,"n_cols":8,"rows_kept":160,"cut":false,"hidden":true,"merged":[[7,1,7,5]]}
[]
[]
[]
[]
[]
[]
[]
[null,"Riferimento offerta MORIS:"]
{"$rows_left_out":153}
{"sheet":"Offer","index":5,"n_rows":159,"n_cols":10,"rows_kept":159,"cut":false,"hidden":true,"merged":[[6,1,6,5],[7,1,7,5]]}
[]
[]
[]
[]
[]
[]
[null,null,null,null,null,null,null,null,null,1]
[null,"MORIS reference number:"]
{"$rows_left_out":152}
{"sheet":"NOTE","index":6,"n_rows":31,"n_cols":11,"rows_kept":31,"cut":false,"hidden":true,"merged":[]}
["ANOMALIE RISCONTRATE - ERROR CHECK"]
[]
[{"$f":"IF(J3=0,\"\",\"Cassone maggiorato non disponibile con centralina elettronica o centralina in fossa\")","v":""},null,null,null,null,null,null,null,null,{"$f":"IF(AND(OR(DATOS!D51=\"ELE\",DATOS!D50=\"CIF\"),'accessori centralina'!F22<>0),1,0)","v":0},"centralina elettronica/centralina in fossa e cassone maggiorato"]
[{"$f":"IF(J3=0,\"\",\"Oversize tank not available with electronic valve or power unit in the tank\")","v":""}]
[{"$f":"IF(J5=0,\"\",\"Centralina in fossa solo per 55-250 litri/min\")","v":""},null,null,null,null,null,null,null,null,{"$f":"IF(AND(OR(DATOS!D45<55,DATOS!D45>250),DATOS!D50=\"CIF\"),1,0)","v":0},"CIF e portata pompa"]
[{"$f":"IF(J5=0,\"\",\"Power unit in the pit available only for 55-250 lit/min\")","v":""}]
[{"$f":"IF(J7=0,\"\",\"La pressione statica massima deve essere pari inferiore a 45 bar\")","v":""},null,null,null,null,null,null,null,null,{"$f":"IF(DATOS!D39>45,1,0)","v":0},"pressione statica massima"]
[{"$f":"IF(J7=0,\"\",\"Max static pressure must be equal or lower than 45 bar\")","v":""}]
{"$rows_left_out":24}
{"sheet":"calcoli vari","index":7,"n_rows":124,"n_cols":6,"rows_kept":124,"cut":false,"hidden":false,"merged":[]}
["Qf",{"$f":"IF(OR(DATOS!D7=\"MCE\",DATOS!D7=\"MCS\"),INDEX(database1!C103:Q104,'accessori centralina'!J7,DATOS!K2),IF(DATOS!D7=\"CRA\",INDEX(database1!C120:Q120,'accessori centralina'!J7,DATOS!K2),INDEX(database1!C84:Q86,'accessori centralina'!J7,DATOS!K2)))","v":200}]
[]
[]
[]
["KMI",170]
["tubazioni",{"$f":"INDEX(B61:B70,DATOS!K19)","v":7}]
["doppio pistone",{"$f":"offerta!A133*INDEX(centraline!C134:F134,1,B9)","v":0}]
["totale",{"$f":"IF(DATOS!D28=\"KMI\",SUM(B5:B7),0)","v":0}]
{"$rows_left_out":117}
{"sheet":"centraline","index":8,"n_rows":679,"n_cols":25,"rows_kept":679,"cut":false,"hidden":false,"merged":[[644,1,644,2],[228,3,229,3],[243,3,244,3],[258,3,259,3],[271,3,272,3],[285,3,286,3],[304,3,305,3],[332,3,333,3],[520,3,521,3],[535,3,536,3],[535,1,535,2],[228,1,228,2],[243,1,243,2],[258,1,258,2],[271,1,271,2],[285,1,285,2],[547,3,548,3],[362,3,363,3],[397,3,398,3],[447,3,448,3],[483,3,484,3],[582,0,583,0],[582,1,582,2],[614,0,615,0],[614,1,614,2],[332,1,332,2],[362,1,362,2],[397,1,397,2],[447,1,447,2],[483,1,483,2],[520,1,520,2],[547,0,548,0],[547,1,547,2],[304,1,304,2],[201,1,201,2],[202,1,202,2],[201,3,202,3],[214,1,214,2],[215,1,215,2],[214,3,215,3],[171,1,171,2],[172,1,172,2],[171,3,172,3],[186,1,186,2],[187,1,187,2],[186,3,187,3]]}
[null,null,null,null,null,null,null,null,null,null,null,"potencia"]
["portata",0.75,1.1000000000000001,1.5,1.8,2,2.2000000000000002,2.5,3,3.3,3.7,4.5,4.8,6,7.5,9.5,12,15,18.5,22.5,30,37,45,60,75]
["55CM","x","x","x","x","x","x","x","x","x","x",{"$f":"D335","v":1597},"x",{"$f":"D336","v":1617},"x","x","x","x","x","x","x","x","x","x","x"]
["75CM","x","x","x","x","x","x","x","x","x","x",{"$f":"D337","v":1597},"x",{"$f":"D338","v":1617},{"$f":"D339","v":1653},"x","x","x","x","x","x","x","x","x","x"]
["100CM","x","x","x","x","x","x","x","x","x","x",{"$f":"D340","v":1601},"x",{"$f":"D341","v":1637},{"$f":"D342","v":1653},{"$f":"D343","v":1680},"x","x","x","x","x","x","x","x","x"]
["125CM","x","x","x","x","x","x","x","x","x","x","x","x",{"$f":"D344","v":1637},{"$f":"D345","v":1653},{"$f":"D346","v":1680},{"$f":"D347","v":1722},"x","x","x","x","x","x","x","x"]
["150CM","x","x","x","x","x","x","x","x","x","x","x","x",{"$f":"D348","v":1637},{"$f":"D349","v":1653},{"$f":"D350","v":1680},{"$f":"D351","v":1722},{"$f":"D352","v":1749},"x","x","x","x","x","x","x"]
["180CM","x","x","x","x","x","x","x","x","x","x","x","x","x","x",{"$f":"D353","v":1972},{"$f":"D354","v":2017},{"$f":"D355","v":2047},{"$f":"D356","v":2081},"x","x","x","x","x","x"]
{"$rows_left_out":672}
{"sheet":"Prezzo P","index":9,"n_rows":211,"n_cols":15,"rows_kept":211,"cut":false,"hidden":true,"merged":[[44,1,44,14],[38,1,38,14],[1,1,1,14],[10,1,10,14],[19,1,19,14],[29,1,29,14]]}
[]
[null,"Prezzo pistoni primi 3 mt. diretto laterale e in taglia (9130-9140)"]
[null,50,60,70,80,85,90,100,110,120,130,150,160,180,200]
[5,{"$f":"B62","v":452},{"$f":"B64","v":477},{"$f":"B66","v":544},{"$f":"B68","v":582},"x",{"$f":"B72","v":659},{"$f":"B75","v":712},{"$f":"B78","v":830},{"$f":"B81","v":858},{"$f":"B84","v":947},"x","x","x","x"]
[6,"x","x","x","x","x","x","x","x","x","x",{"$f":"B87","v":1156},"x","x","x"]
[7.5,{"$f":"B63","v":488},{"$f":"B65","v":511},{"$f":"B67","v":582},{"$f":"B69","v":617},{"$f":"B71","v":617},{"$f":"B73","v":697},{"$f":"B76","v":763},{"$f":"B79","v":911},{"$f":"B82","v":969},{"$f":"B85","v":1061},"x","x","x","x"]
[10,"x","x","x","x","x","x","x","x","x","x",{"$f":"B88","v":1301},{"$f":"B89","v":1801},{"$f":"B90","v":2177},{"$f":"B91","v":2841}]
[12,"x","x","x",{"$f":"B70","v":675},"x",{"$f":"B74","v":763},{"$f":"B77","v":836},{"$f":"B80","v":984},{"$f":"B83","v":1032},{"$f":"B86","v":1120},"x","x","x","x"]
{"$rows_left_out":204}
{"sheet":"database1","index":10,"n_rows":120,"n_cols":19,"rows_kept":120,"cut":false,"hidden":false,"merged":[]}
[]
[]
["CARATTERISTICHE GEOMETRICHE PER IL CALCOLO DEGLI STELI"]
[]
[]
[null,null,null,null,null,null,"DIAMETRO PISTONE"]
[null,null,"SPESSORE",36,50,60,70,80,85,90,100,110,120,130,150,160,180,200]
["SEZIONE","Ax0",0,1018,"x","x","x","x","x","x","x","x","x","x","x","x","x","x"]
{"$rows_left_out":113}
{"sheet":"accessori centralina","index":11,"n_rows":75,"n_cols":11,"rows_kept":75,"cut":false,"hidden":false,"merged":[]}
[4]
[{"$f":"INDEX(lingue!B58:E58,1,$A$1)","v":"Descuento"},null,0]
[{"$f":"INDEX(lingue!B135:E135,1,$A$1)","v":"Cantidad"},null,{"$f":"DATOS!D13*IF(OR(DATOS!K12=1,DATOS!K12=2),1,0)","v":1},null,null,{"$f":"INDEX(lingue!B136:E136,1,$A$1)","v":"Qt"},{"$f":"INDEX(lingue!B137:E137,1,$A$1)","v":"precio €"}]
[{"$f":"INDEX(lingue!B138:E138,1,$A$1)","v":"Pistón"},{"$f":"DATOS!D24","v":70},{"$f":"INDEX(lingue!B139:D139,1,$A$1)","v":{"$error":"#REF!"}},{"$f":"DATOS!D25","v":5},"3 mt",{"$f":"1*C3","v":1},null,{"$f":"IF(B5=9150,INDEX('Prezzo P'!B22:O26,J5,J4),INDEX('Prezzo P'!B4:O8,J5,J4))*C3","v":544},"prametro 3mt.",{"$f":"MATCH(B4,'Prezzo P'!B3:O3,0)","v":3}]
[{"$f":"INDEX(lingue!B140:E140,1,$A$1)","v":"modelo"},{"$f":"DATOS!D7","v":9130},null,"m",null,{"$f":"IF(DATOS!D21<3000,0,DATOS!D21-3000)/1000","v":0},{"$f":"(INDEX('Prezzo P'!$B$13:$O$17,$J$5,$J$4))","v":62},{"$f":"G5*F5*C3","v":0},"parametro 3mt",{"$f":"MATCH(D4,'Prezzo P'!A4:A8,0)","v":1}]
[{"$f":"INDEX(lingue!B141:E141,1,$A$1)","v":"en 2 piezas"},null,null,null,null,null,null,{"$f":"INDEX('Prezzo P'!B32:O36,J5,J4)*IF(DATOS!D14>1,1,0)*C3","v":0}]
[{"$f":"INDEX(lingue!B142:E142,1,$A$1)","v":"en 3 piezas"},null,null,null,null,null,null,{"$f":"H6*1.2*(DATOS!D14-2)","v":0},"indice",{"$f":"IF(OR(DATOS!D7=\"MCE\",DATOS!D7=\"MCS\"),MATCH(DATOS!D7,database1!B103:B104,0),IF(DATOS!D7=\"CRA\",MATCH(DATOS!D7,database1!B120:B120,0),MATCH(DATOS!D7,database1!B84:B86,0)))","v":1},"indice del tipo di pistone (9130, 9140 o 9150/MCE/S)"]
[{"$f":"INDEX(lingue!B143:E143,1,$A$1)","v":"ram head gasket"},null,null,null,null,0,{"$f":"INDEX('Prezzo P'!$B$41:$O$42,J8,$J$4)","v":11},{"$f":"G8*F8*$C$3","v":0},"para ",1]
{"$rows_left_out":68}
{"sheet":"EN 81.50","index":12,"n_rows":120,"n_cols":9,"rows_kept":120,"cut":false,"hidden":false,"merged":[[95,1,95,6],[36,1,36,6],[37,1,37,6],[38,1,38,6],[3,2,3,5],[4,2,4,5]]}
[null,{"$f":"INDEX(lingue!B362:E362,1,DATOS!$B$5)","v":"CÁLCULO DEL PISTÓN"}]
[null,{"$f":"INDEX(lingue!B363:E363,1,DATOS!$B$5)","v":"CONFORME EN 81-50:2014"}]
[]
[null,{"$f":"INDEX(lingue!B292:E292,1,DATOS!$B$5)","v":"Cliente"},"INAUXA"]
[null,{"$f":"INDEX(lingue!B293:E293,1,DATOS!$B$5)","v":"Referncia Instalación:"},170221]
[]
[null,{"$f":"INDEX(lingue!B294:E294,1,DATOS!$B$5)","v":"DATOS DE LA INSTALACION"}]
[]
{"$rows_left_out":113}
{"sheet":"EN 81.50 (T)","index":13,"n_rows":97,"n_cols":21,"rows_kept":97,"cut":false,"hidden":false,"merged":[[3,1,3,4],[4,1,4,4]]}
["CÁLCULO DEL PISTÓN TELESCOPICO"]
["CONFORME EN 81-50:2014"]
["REV4"]
["Cliente"]
["Referncia Instalación:",null,null,null,null,null,null,null,null,null,null,null,null,null,null,null,null,null,"36/60","60/80"]
[null,null,null,null,null,null,null,null,null,null,null,null,null,null,null,null,null,"Modelos",1,2]
["DATOS DE LA INSTALACION",null,null,null,null,null,null,null,null,null,"Densidad acero",7.85,"gr/cm3",null,null,null,null,"36/60",80,110]
[null,null,null,null,null,null,null,null,null,null,null,null,null,null,null,null,null,"60/80",5,5]
{"$rows_left_out":90}
{"sheet":"EN 81.50 HCR-75","index":14,"n_rows":121,"n_cols":19,"rows_kept":121,"cut":false,"hidden":false,"merged":[[97,1,97,6],[3,2,3,5],[4,2,4,5],[37,1,37,6],[38,1,38,6],[39,1,39,6]]}
[null,{"$f":"INDEX(lingue!B362:E362,1,DATOS!$B$5)","v":"CÁLCULO DEL PISTÓN"}]
[null,{"$f":"INDEX(lingue!B363:E363,1,DATOS!$B$5)","v":"CONFORME EN 81-50:2014"}]
[]
[null,{"$f":"INDEX(lingue!B292:E292,1,DATOS!$B$5)","v":"Cliente"}]
[null,{"$f":"INDEX(lingue!B293:E293,1,DATOS!$B$5)","v":"Referncia Instalación:"}]
[]
[null,{"$f":"INDEX(lingue!B294:E294,1,DATOS!$B$5)","v":"DATOS DE LA INSTALACION"},null,null,null,null,null,null,null,null,"Densidad acero",7850,null,null,null,null,"Recorrido (m)","Carga (kg)","Pmax"]
[null,null,null,null,null,null,null,null,null,null,null,null,null,null,null,null,15,200]
{"$rows_left_out":114}
{"sheet":"velocidad","index":15,"n_rows":146,"n_cols":92,"rows_kept":146,"cut":false,"hidden":false,"merged":[[1,1,1,15],[2,1,2,15],[77,1,77,35],[1,19,1,35]]}
[null,"real"]
[null,"VELOCITA' CENTRALINA 50hz",null,null,null,null,null,null,null,null,null,null,null,null,null,null,null,null,null,"VELOCITA' CENTRALINA 60Hz",null,null,null,null,null,null,null,null,null,null,null,null,null,null,null,null,null,null,"SETTIMA"]
["teorico","DIAMETRO PISTONE",null,null,null,null,null,null,null,null,null,null,null,null,null,null,"real",null,null,null,null,"DIAMETRO PISTONE",null,null,null,null,null,null,null,null,null,null,null,null,null,null,null,null,null,null,null,null,null,null,null,null,null,null,null,null,null,null,null,null,null,null,null,null,null,null,null,null,null,null,"Teórica","\"REAL 50HZ\"",null,null,null,null,null,null,null,null,null,null,null,"Area dm^2",null,null,null,null,null,null,null,null,null,null,null,null,"VISCOSIDAD VERKOL HM46"]
["POMPA",36,50,60,70,80,85,90,100,110,120,130,150,160,180,200,238,76.099999999999994,null,"POMPA",null,"POMPA",36,50,60,70,80,85,90,100,110,120,130,150,160,180,200,238,76.099999999999994,null,null,null,null,null,null,null,null,null,null,null,null,null,null,null,null,null,null,null,null,null,null,null,null,null,"POMPA","POMPA","%DES",36,50,60,70,75,80,85,90,100,160,null,36,50,60,70,75,80,85,90,100,160,null,null,"T(ºC)","Viscosidad (cSt)"]
[8,0.13097576948264572,0.06,0.04,0.03,0.02,0.02,0.02,"x","x","x","x","x","x","x","x","x",0.02,null,10,null,8,{"$f":"B5*1.2","v":0.15717092337917485},7.1999999999999995E-2,4.8000000000000001E-2,3.5999999999999997E-2,2.4E-2,2.4E-2,2.4E-2,"x","x","x","x","x","x","x","x","x",{"$f":"R5*1.2","v":2.4E-2},null,null,null,null,null,null,null,null,null,null,null,null,null,null,null,null,null,null,null,null,null,null,null,null,null,8,8,{"$f":"BN5/BM5","v":1},{"$f":"$BN5/(CA5*600)","v":0.13097576948264572},{"$f":"$BN5/(CB5*600)","v":6.7923246731193751E-2},4.7164249498879846E-2,3.4650034650034647E-2,2.5513458349279251E-2,2.5513458349279251E-2,2.3494860499265784E-2,2.0961064822092961E-2,1.6976487564722857E-2,1.4030187820773142E-2,null,0.1018,0.1963,0.28270000000000001,0.38479999999999998,0.52259999999999995,0.52259999999999995,0.5675,0.6361,0.78539999999999999,{"$f":"PI()*1.1^2/4","v":0.9503317777109126},null,null,5,383.56]
[12,0.19646365422396858,0.1,7.0000000000000007E-2,0.05,0.04,0.03,0.03,"x","x","x","x","x","x","x","x","x",0.04,null,15,null,12,0.23575638506876229,0.12,8.4000000000000005E-2,0.06,4.8000000000000001E-2,3.5999999999999997E-2,3.5999999999999997E-2,"x","x","x","x","x","x","x","x","x",4.8000000000000001E-2,null,null,null,null,null,null,null,null,null,null,null,null,null,null,null,null,null,null,null,null,null,null,null,null,null,12,12,1,0.19646365422396858,0.10188487009679062,7.0746374248319768E-2,5.1975051975051978E-2,3.8270187523918871E-2,3.8270187523918871E-2,3.5242290748898682E-2,3.144159723313944E-2,2.5464731347084289E-2,2.1045281731159712E-2,null,0.1018,0.1963,0.28270000000000001,0.38479999999999998,0.52259999999999995,0.52259999999999995,0.5675,0.6361,0.78539999999999999,{"$f":"PI()*1.1^2/4","v":0.9503317777109126},null,null,10,262.47000000000003]
[15,0.24557956777996071,0.12,0.08,0.06,0.05,0.04,0.04,"x","x","x","x","x","x","x","x","x",0.05,null,19,null,15,0.29469548133595286,0.14399999999999999,9.6000000000000002E-2,7.1999999999999995E-2,0.06,4.8000000000000001E-2,4.8000000000000001E-2,"x","x","x","x","x","x","x","x","x",0.06,null,null,null,null,null,null,null,null,null,null,null,null,null,null,null,null,null,null,null,null,null,null,null,null,null,15,15,1,0.24557956777996071,0.1273560876209883,8.8432967810399721E-2,6.4968814968814972E-2,4.7837734404898594E-2,4.7837734404898594E-2,4.405286343612335E-2,3.93019965414243E-2,3.1830914183855356E-2,{"$f":"$BN7/(CJ7*600)","v":2.630660216394964E-2},null,0.1018,0.1963,0.28270000000000001,0.38479999999999998,0.52259999999999995,0.52259999999999995,0.5675,0.6361,0.78539999999999999,0.9503317777109126,null,null,15,185.04]
[18,0.29469548133595286,0.15,0.1,7.0000000000000007E-2,0.06,0.05,0.05,"x","x","x","x","x","x","x","x","x",0.06,null,22,null,18,0.35363457760314343,0.18,0.12,8.4000000000000005E-2,7.1999999999999995E-2,0.06,0.06,"x","x","x","x","x","x","x","x","x",7.1999999999999995E-2,null,null,null,null,null,null,null,null,null,null,null,null,null,null,null,null,null,null,null,null,null,null,null,null,null,18,18,1,0.29469548133595286,0.15282730514518594,0.10611956137247966,7.7962577962577967E-2,5.740528128587831E-2,5.740528128587831E-2,5.2863436123348019E-2,4.716239584970916E-2,3.819709702062643E-2,{"$f":"$BN8/(CJ8*600)","v":3.1567922596739566E-2},null,0.1018,0.1963,0.28270000000000001,0.38479999999999998,0.52259999999999995,0.52259999999999995,0.5675,0.6361,0.78539999999999999,0.9503317777109126,null,null,20,134.01]
{"$rows_left_out":139}
{"sheet":"lingue","index":16,"n_rows":365,"n_cols":5,"rows_kept":365,"cut":false,"hidden":false,"merged":[[318,4,318,9],[319,4,319,9],[320,4,320,9],[360,4,360,9]]}
["Italiano","Italiano ","English","Deutsch","Español"]
["English","Progetto Pistone modello (9130; 9140; 9150;MCS;MCE)","Ram type (9130; 9140; 9150;MCS;MCE)","Heberbezeichnung (9130; 9140; 9150;MCS;MCE)","Modelo Piston (9130;9140;9150;MCS;MCE)"]
["Deutsch","Coefficiente di taglia                                                                                        ","Rope acting (2) direct acting (1)","Aufhängung","Suspension (2 2:1) (1 1:1)"]
["Español","Portata utile                                                                                                             ","Load","Nennlast","Carga"]
[null,"Massa della cabina e degli organi ad essa collegati   ","car and sling weight","Farhkorbgewicht","Peso de la cabina y chasis"]
[null,"Massa delle funi lato cabina                          ","ropes weight (car side)","Gewicht Seil","Peso de los cables lado cabina"]
[null,"Massa delle funi lato cabina (per pistone)","ropes weight (car side, per piston)","Gewicht Seil","Peso de los cables por piston"]
[null,"Massa di puleggia e arcatina","pulley weight","Gewicht Rolle","Peso de la polea"]
{"$rows_left_out":358}
{"sheet":"COMPRESIBILIDAD DEL ACEITE","index":17,"n_rows":33,"n_cols":29,"rows_kept":33,"cut":false,"hidden":false,"merged":[[10,25,10,26],[7,6,7,7],[7,12,7,13],[7,18,7,19],[7,25,7,26],[8,25,8,26],[9,25,9,26],[5,6,5,7],[5,12,5,13],[5,18,5,19],[6,6,6,7],[6,12,6,13],[6,18,6,19]]}
[]
[null,"Datos a introducir",null,null,null,null,"Deriva del ascensor por disminución de Temperatura",null,null,null,null,null,"Deriva del ascensor por Incremento de Presión",null,null,null,null,null,"Disminución de la presión por disminución de temperatura en un circuito cerrado",null,null,null,null,null,null,"Disminución de la presión en función de la deriva"]
[null,null,null,null,null,null,"ΔT (ºC)","Disminución de Temperatura",null,null,null,null,"ΔP (bar)","Incremento de Presión",null,null,null,null,"ΔT (ºC)","Disminución de Temperatura",null,null,null,null,null,"ΔP (bar)","Disminución de Presión"]
[null,"Cálculos",null,null,null,null,"a (cm)","Deriva",null,null,null,null,"a (cm)","Deriva",null,null,null,null,"ΔP (bar)","Disminución de Presión",null,null,null,null,null,"a (cm)","Deriva"]
[null,null,null,null,null,null,null,null,null,null,null,null,null,null,null,null,null,null,null,null,null,null,null,null,null,"β","Factor de compresibilidad del fluido "]
[null,null,null,null,null,null,"T inicial",null,31,"ºC",null,null,"P inicial",null,{"$f":"DATOS!D40","v":23.39178238215667},"bar",null,null,"T inicial",null,31,"ºC",null,null,null,"Av","Sección del émbolo"]
[null,"Tiro","r",{"$f":"DATOS!D8","v":"2"},":1",null,"T final",null,30,"ºC",null,null,"P final",null,{"$f":"DATOS!D39","v":39},"bar",null,null,"T final",null,30,"ºC",null,null,null,"VT","Volumen de aceite con camisa desplegada"]
[null,"Longitud de Cilindro","Lp",{"$f":"DATOS!D21","v":1550},"mm",null,"Deriva final",null,{"$f":"D$7*D$14*D$11*(I6-I7)*100/D$15","v":4.7896849244897961},"mm",null,null,"Deriva final",null,{"$f":"D$7*D$14*D$12*(O7-O6)*100/D$15","v":10.042179128374061},"mm",null,null,"Disminución Presión",null,{"$f":"D$11*(U6-U7)/D$12","v":7.4444444444444446},"bar",null,null,null,"T inicial",null,31,"ºC"]
{"$rows_left_out":25}